The lmbench package (largely unmaintained upstream, last release in
2006) uses a home-grown build system. The scripts/build script sets
LDLIBS to -lm and Buildroot's makefile changes that to:
LDLIBS+=-lm
Except that when Buildroot passes LDLIBS="`$(PKG_CONFIG_HOST_BINARY)
--libs libtirpc`", the LDLIBS variable ends up being equal to:
-ltirpc-lm
Yes, without any space between -ltirpc and -lm.
Due to this, the checks in scripts/build that use ${LDLIBS} all fail,
and in particular the test that checks when socklen_t is a known type
fails, causing lmbench to provide its own definition, which clashes
with the C library headers definition, and therefore causing build
failures such as:
bench.h:81:13: error: conflicting types for 'socklen_t'; have 'int'
This commit fixes that by adjusting scripts/build using a patch to
properly allow passing additional ${LDLIBS} value, with the needed
space to separate the value from -lm.
Fixes:
http://autobuild.buildroot.net/results/f1715de95b46a1d08143e529bd4574bc7dbcfb3e/
We have been unable to determine exactly when this issue was
introduced. The first build failure we could find is the one
referenced above, which dates back from Aug 19, 2024. Since this date,
lmbench has been consistently failing on a very regular
basis. However, prior to Aug 19, 2024, the previous failure was from
December 2022, and was unrelated. It is unclear what changed in Aug
2024 to cause this issue to surface. The one thing that changed right
before commit ce3dedc2 (first failing commit) are changes to
genrandconfig, which ensures all autobuilders now generated fully
random configurations instead of configurations based on a
well-defined list of arch/toolchain configurations. But even with
this, this lmbench issue should have appeared earlier, and we have
been unable to find a scientific explanation.
Signed-off-by: Thomas Petazzoni <thomas.petazzoni@bootlin.com>
Signed-off-by: Peter Korsgaard <peter@korsgaard.com>
(cherry picked from commit 80f25d4706)
Signed-off-by: Peter Korsgaard <peter@korsgaard.com>
The android-tools code base uses the __b64_pton() function, which
isn't provided by all C libraries. So the Debian patch
debian/patches/add_adbd.patch adds an implementation of b64_pton(),
but doesn't actually use it, nor defines a prototype for it. Our
existing patch 0003-Fix-build-issue-with-uclibc.patch switches the
code to use the b64_pton() function... but still without providing a
prototype, causing the following build failures with GCC >= 14.x:
adb_auth_client.c:75:15: error: implicit declaration of function 'b64_pton'
To fix this, we rework 0003-Fix-build-issue-with-uclibc.patch into a
patch that:
(1) Renames b64_pton() to adb_b64_pton() to make sure it won't clash
with implementations provided by some C libraries, and adjusts
the call sites accordingly.
(2) Adds a prototype definition of adb_b64_pton() in places where
this function is used.
Fixes:
http://autobuild.buildroot.net/results/b25b25337c7ad89c33f8bd20b646850bd993ec53ae9/
Even though GCC 14.x support was merged in Buildroot in May 2024, this
particular b64_pton() only started appearing on July 15 2024, with the
first occurrence being:
http://autobuild.buildroot.net/results/1cbe87bbe3c56f28444b3aaba1ba1d05f947d36e/
Indeed, it's not before July 15 2024 that we merged commit
d201f2f5cd ("package/android-tools: add
patches to fix build with GCC 14.x"), which fixed other GCC 14.x
issues, which were hiding this b64_pton() problem.
Signed-off-by: Thomas Petazzoni <thomas.petazzoni@bootlin.com>
Signed-off-by: Arnout Vandecappelle <arnout@mind.be>
(cherry picked from commit 1eec67d164)
Signed-off-by: Peter Korsgaard <peter@korsgaard.com>
The kernel headers on mips64 and powerpc64 were historically "broken",
defining u64 as an "unsigned long" instead of "unsigned long
long". This has been fixed in the upstream Linux kernel by introducing
the __SANE_USERSPACE_TYPES__ definition.
Our commit a2e178d6b4 ("android-tools:
disable on some architecture with old kernel headers") already
disabled building fastboot on powerpc64 and mips64 systems that have
too old kernel headers. However, it turns out that even with the new
kernel headers, there are build issues because
__SANE_USERSPACE_TYPES__ isn't defined everywhere it should be in the
android-tools code base. The Debian patche
debian/patches/ppc64el-ftbfs.patch adds some definitions, but it's
missing one file, and in another the definition comes too late.
This commit adds an extra patch that fixes this up, and makes fastboot
build properly on mips64 and powerpc64.
Fixes:
http://autobuild.buildroot.net/results/8528ff876e695f79bdfe64f5330d9d51eeef66cb/ (powerpc64)
http://autobuild.buildroot.net/results/36ac6af73b618c28d1636093da333f7ebd9d6cfe/ (mips64)
This issue has been occurring as far as Feb 2021, with the first
occurence apparently being:
http://autobuild.buildroot.net/results/d9521b4bfeafb1140c21745dbfe28d476a9b71ec/
Signed-off-by: Thomas Petazzoni <thomas.petazzoni@bootlin.com>
Signed-off-by: Arnout Vandecappelle <arnout@mind.be>
(cherry picked from commit ee65a2119a)
Signed-off-by: Peter Korsgaard <peter@korsgaard.com>
This will make it easier to modify the patch series moving forward. No
functional changes.
On one patch, we added the SoB from Giulio, which was missing. Giulio
was the original contributor of the patch, and nobody touched it since
it was introduced.
Signed-off-by: Thomas Petazzoni <thomas.petazzoni@bootlin.com>
Signed-off-by: Arnout Vandecappelle <arnout@mind.be>
(cherry picked from commit 3ee745782a)
Signed-off-by: Peter Korsgaard <peter@korsgaard.com>
losetup -f returns the next free loop device, which may not be
/dev/loop0. If you blindly follow the readmy you may end up destroying
an existing device.
Make it more robust with a variable to store the loop device.
Signed-off-by: Cherniaev Andrei <dungeonlords789@naver.com>
[Arnout: keep the actual losetup atomic]
Signed-off-by: Arnout Vandecappelle <arnout@mind.be>
(cherry picked from commit 7dd56b6cd9)
Signed-off-by: Peter Korsgaard <peter@korsgaard.com>
nfs-utils configure script uses "systemd-escape" to determine the
rpc_pipefs mount point unit name in the non-default case.
If the host build system has no systemd this will silently result in an
empty name, causing rpc_pipefs.target to incorrectly depend on ".mount".
Fix that by depending on host-systemd for build.
Signed-off-by: Anssi Hannula <anssi.hannula@bitwise.fi>
Acked-by: Petr Vorel <petr.vorel@gmail.com>
Signed-off-by: Arnout Vandecappelle <arnout@mind.be>
(cherry picked from commit 4c9b13b8dd)
Signed-off-by: Peter Korsgaard <peter@korsgaard.com>
As it happens, I am unable to keep maintaining those entries, and it is
misleading to others about whether they should Cc me on their changes.
Signed-off-by: Yann E. MORIN <yann.morin.1998@free.fr>
Signed-off-by: Julien Olivain <ju.o@free.fr>
(cherry picked from commit 773a89d414)
Signed-off-by: Peter Korsgaard <peter@korsgaard.com>
When halting the boot process in u-boot, the 'usb start' command does not
automatically run. Since the SD card is connected over a USB to SD card
bridge on the kd240 and kr260 boards, the readme.txt instructions should
document that the 'usb start' command needs to be manually enterred when
following the reflashing instructions. Otherwise, the command to read the
boot.bin and u-boot.itb files from the SD card will fail.
Signed-off-by: Neal Frager <neal.frager@amd.com>
Signed-off-by: Julien Olivain <ju.o@free.fr>
(cherry picked from commit e02e59d124)
Signed-off-by: Peter Korsgaard <peter@korsgaard.com>
The mosquitto runtime test can randomly fail on slow
runners, see [1].
This commit improves this test in the following ways:
- the mosquitto_sub subscriber process is now started in a subshell
to suppress the job control messages (to prevent any spurious
messages when the job stops),
- the standard error is redirected to /dev/null, to prevent the
printing of any messages,
- the mosquitto_pub publisher process is started later, by increasing
the sleep time,
- finally, a new sleep time is introduced between the mosquitto_pub
publisher process and the check of the mosquitto_sub subscriber, to
make sure it will have time to write its output and exit.
Fixes: [1]
[1] https://gitlab.com/buildroot.org/buildroot/-/jobs/8453386454
Signed-off-by: Julien Olivain <ju.o@free.fr>
Signed-off-by: Thomas Petazzoni <thomas.petazzoni@bootlin.com>
(cherry picked from commit 07a444d088)
Signed-off-by: Peter Korsgaard <peter@korsgaard.com>
Host bmap-tools runs using host-python3, but did not select it,
leading to the confusing situation that BR2_PACKAGE_HOST_PYTHON3=n
even though it was built and working.
Signed-off-by: Fiona Klute (WIWA) <fiona.klute@gmx.de>
Signed-off-by: Peter Korsgaard <peter@korsgaard.com>
(cherry picked from commit dbb019db73)
Signed-off-by: Peter Korsgaard <peter@korsgaard.com>
Commit 29409c9d34 ("package/systemd: fix
build with recent kernels") added a patch from upstream that adds the
BCACHEFS_SUPER_MAGIC definition if not provided by the kernel headers.
However, this commit from upstream was bogus: in the case
BCACHEFS_SUPER_MAGIC was defined, it does an assert_cc() to verify
that the value matches what we expect, but this assert_cc() statement
lacks the final semi-colon, causing build breakage on host systems
that do have BCACHEFS_SUPER_MAGIC defined in their kernel headers,
with a weird error occuring in another header file... because only the
next statement after assert_cc() was considered as having a syntax
error.
Fixes:
http://autobuild.buildroot.net/results/9f99a97df2efd5e4ae4ad5cc5882607f0c8766bc/
This issue only exists in 2024.02.x at this point, because in master
we have moved to systemd 256.x, which has dropped entirely this piece
of code related to defining BCACHEFS_SUPER_MAGIC (and we wonder how
systemd can then build with slightly older kernel headers, as
BCACHEFS_SUPER_MAGIC is only in the public kernel headers since Linux
6.10).
Signed-off-by: Thomas Petazzoni <thomas.petazzoni@bootlin.com>
Signed-off-by: Peter Korsgaard <peter@korsgaard.com>
This test started failing at commit
0cad947b96
"support/testing/infra/emulator.py: fix qemu prompt detection" with the
error message
AttributeError: 'NoneType' object has no attribute 'run_command'
This is because we changed emulator.run() so that emulator.login() must
be called first. But this test skips the login and goes directly to a
shell. Use the new emulator.connect_shell() function which prepares the
shell without logging in.
Signed-off-by: Brandon Maier <brandon.maier@collins.com>
Signed-off-by: Thomas Petazzoni <thomas.petazzoni@bootlin.com>
(cherry picked from commit 5ed1fab018)
Signed-off-by: Peter Korsgaard <peter@korsgaard.com>
The TestInitSystemNone bypasses the normal init and instead launches
directly into a shell. So it needs to bypass the login code and go
directly to a shell.
Signed-off-by: Brandon Maier <brandon.maier@collins.com>
Signed-off-by: Thomas Petazzoni <thomas.petazzoni@bootlin.com>
(cherry picked from commit 95e1043013)
Signed-off-by: Peter Korsgaard <peter@korsgaard.com>
Asaf has privately requested to be removed from the DEVELOPERS file as
he will no longer be contributing to Buildroot in the forseeable
future.
Signed-off-by: Thomas Petazzoni <thomas.petazzoni@bootlin.com>
(cherry picked from commit 353a37b04d)
Signed-off-by: Peter Korsgaard <peter@korsgaard.com>
The rootfs partition is the first partition, not the second one: the
Grub configuration file already contains root=/dev/sda1 by default,
and it should be changed to root=/dev/vda1 if Qemu emulation is used.
Signed-off-by: Cherniaev Andrei <dungeonlords789@naver.com>
Signed-off-by: Thomas Petazzoni <thomas.petazzoni@bootlin.com>
(cherry picked from commit 9e3d572ff5)
Signed-off-by: Peter Korsgaard <peter@korsgaard.com>
The systemd service deployed to the target is derived from an example
hardcoded for the /usr/local/sbin/ path, but we install sshguard at
/usr/sbin/. Thus, by default we get this error message:
$ journalctl -b -u sshguard.service -f
systemd[1]: Started SSHGuard - blocks brute-force login attempts.
(sshguard)[612]: sshguard.service: Unable to locate executable '/usr/local/sbin/sshguard': No such file or directory
(sshguard)[612]: sshguard.service: Failed at step EXEC spawning /usr/local/sbin/sshguard: No such file or directory
systemd[1]: sshguard.service: Main process exited, code=exited, status=203/EXEC
systemd[1]: sshguard.service: Failed with result 'exit-code'.
systemd[1]: sshguard.service: Scheduled restart job, restart counter is at 5.
systemd[1]: sshguard.service: Start request repeated too quickly.
systemd[1]: sshguard.service: Failed with result 'exit-code'.
systemd[1]: Failed to start SSHGuard - blocks brute-force login attempts.
Fix up the path in the service after the $(INSTALL) command has run.
Signed-off-by: Vladimir Oltean <olteanv@gmail.com>
Signed-off-by: Thomas Petazzoni <thomas.petazzoni@bootlin.com>
(cherry picked from commit 750d0e377d)
Signed-off-by: Peter Korsgaard <peter@korsgaard.com>
This patch fixes a regression [1] introduced in ntpd 4.2.8p18 [2].
ntpd[200]: Listen normally on 3 lo [::1]:123
ntpd[200]: bind(20) AF_INET6 [fe80::bf3d:254d:dee0:d345%3]:123 flags 0x811 failed: Cannot assign requested address
ntpd[200]: unable to create socket on enp0s3 (4) for [fe80::bf3d:254d:dee0:d345%3]:123
ntpd[192]: daemon control: got EOF
ntpd[192]: daemon child died with signal 11
systemd[1]: ntpd.service: Control process exited, code=exited, status=70/SOFTWARE
systemd[1]: ntpd.service: Failed with result 'exit-code'.
systemd[1]: Failed to start Network Time Service.
If the IPv6 link-local interface was not ready for binding on the first
attempt, ntpd would segfault in update_interfaces(). The segfault would
only occur when ntpd was started as part of the boot sequence. Most
- but not all - boots were affected. Evidently it could happen that the
timing of ntpd's start up was delayed enough that the IPv6 link-local
interface was ready for the bind() call when it was first issued by
open_socket() via create_interface().
[1]: https://bugs.ntp.org/show_bug.cgi?id=3928
[2]: https://bugs.ntp.org/show_bug.cgi?id=3913
Signed-off-by: TIAN Yuanhao <tianyuanhao3@163.com>
Cc: Bernd Kuhls <bernd.kuhls@t-online.de>
Signed-off-by: Thomas Petazzoni <thomas.petazzoni@bootlin.com>
(cherry picked from commit 489e38fd2c)
Signed-off-by: Peter Korsgaard <peter@korsgaard.com>
Since commit
a39e0b95e1 ("package/qt6/qt6base: add
support for concurrent module"), we have an explicit option that
enables/disables concurrent support, so it no longer makes sense to
explicitly disable it unconditionally first.
Signed-off-by: Hannah Kiekens <hannah.kiekens@mind.be>
Signed-off-by: Thomas Petazzoni <thomas.petazzoni@bootlin.com>
(cherry picked from commit 2de79d7065)
Signed-off-by: Peter Korsgaard <peter@korsgaard.com>
The homepage has moved, the previous one links to the new URL.
Signed-off-by: Fiona Klute (WIWA) <fiona.klute@gmx.de>
[yann.morin.1998@free.fr: split into its own patch]
Signed-off-by: Yann E. MORIN <yann.morin.1998@free.fr>
Signed-off-by: Thomas Petazzoni <thomas.petazzoni@bootlin.com>
(cherry picked from commit 3ee7c891a0)
Signed-off-by: Peter Korsgaard <peter@korsgaard.com>
When compiling jailhouse with BR2_PACKAGE_JAILHOUSE_HELPER_SCRIPTS=y,
build is failing with error:
Traceback (most recent call last):
File "/buildroot/output/build/jailhouse-e57d1eff6d55aeed5f977fe4e2acfb6ccbdd7560/setup.py", line 18, in <module>
setup(name="pyjailhouse", version=version,
File "/buildroot/output/host/lib/python3.12/site-packages/setuptools/__init__.py", line 108, in setup
return distutils.core.setup(**attrs)
^^^^^^^^^^^^^^^^^^^^^^^^^^^^^
...
File "/buildroot/output/host/lib/python3.12/sysconfig.py", line 549, in _init_posix
_temp = __import__(name, globals(), locals(), ['build_time_vars'], 0)
^^^^^^^^^^^^^^^^^^^^^^^^^^^^^^^^^^^^^^^^^^^^^^^^^^^^^^^^^^^^^
ValueError: Empty module name
This is due to a missing dependency on the target python3 package.
Jailhouse Python scripts are using setuptools with host-python3 which
reads its sysconfig data from the target-python3. See:
https://gitlab.com/buildroot.org/buildroot/-/blob/2024.08.1/package/pkg-python.mk?ref_type=tags#L33
If the target python3 is not installed, this get expanded as an empty
string, leading to this "ValueError: Empty module name" error.
Pure Python packages which are using the python-package infrastructure
usually get this dependency automatically from:
https://gitlab.com/buildroot.org/buildroot/-/blob/2024.08.1/package/pkg-python.mk?ref_type=tags#L295
Here, the jailhouse package rather uses the generic-package
infrastructure, then installs the Python scripts (if enabled) with
dedicated macros. This is why the target python3 is needed.
This commit fixes the issue by adding this missing dependency.
Signed-off-by: Julien Olivain <ju.o@free.fr>
Signed-off-by: Thomas Petazzoni <thomas.petazzoni@bootlin.com>
(cherry picked from commit c808e271e3)
Signed-off-by: Peter Korsgaard <peter@korsgaard.com>
0001-nano.patch: both MOD_NANO and MOD_TAI were added to glibc 2.12
on 2011-03-30 in commit 83fe108b0a9bc4f2deb14695bb0c8b2011e79f28.
They were added to musl 0.7.5 in commit f5ba2bc9c on 2011-03-18. And
they were added to uClibc 1.0.23 in commit 2d8ea0524b on 2017-03-17. We
consider all of these old enough to assume they always exist.
Renumber the remaining patches.
Signed-off-by: Yegor Yefremov <yegorslists@googlemail.com>
Signed-off-by: Arnout Vandecappelle <arnout@mind.be>
(cherry picked from commit eee73d0cc0)
Signed-off-by: Peter Korsgaard <peter@korsgaard.com>
Fix pthread_detach() detection that is broken when building
with GCC 14.x:
checking for pthread_kill... yes
checking for pthread_rwlock_destroy with <pthread.h>... yes
checking for pthread_detach with <pthread.h>... no
configure: error: could not locate pthread_detach()
make[1]: *** [package/pkg-generic.mk:273:
/home/user/buildroot/bsp-barebox/build/ntp-4.2.8p17/.stamp_configured]
Error 1
make: *** [Makefile:82: _all] Error 2
Reference: https://bugs.ntp.org/show_bug.cgi?id=3926
Additionally, refresh patch 0002 to fix the offset of hunk 1.
Signed-off-by: Yegor Yefremov <yegorslists@googlemail.com>
Signed-off-by: Yann E. MORIN <yann.morin.1998@free.fr>
(cherry picked from commit 40d0797027)
Signed-off-by: Peter Korsgaard <peter@korsgaard.com>
This is bugfix release of stable libmdbx branch.
The most significant fixes since v0.12.10 (the previous version pinned to
buildroot):
- Fixed the possibility of `SIGSEGV` inside the `coherence_check()` after
changing the geometry by another process with an increase in the upper
DB size above the previous in-process limit.
- Fixed cursor(s) handling opened in parent transactions and closed before
the completion of nested/child transactions. In such case, closed
cursors were "resurrected", which led to a leak of memory allocated for
such cursors.
- Fixed a possibility of `SIGSEGV` when enabling logging of the
`MDBX_LOG_TRACE` level in debug builds.
- Correction of the missing `TXN_END_EOTDONE` in the case the start of
a reading transaction fails. The mentioned bit-flag was missing in the
transaction destruction/shutdown path on error its launch. Because of
this, an attempt was made to destroy the cursors, which led to crash
debug builds, since the corresponding array is intentionally filled
with poison pointers.
- Modification of `mdbx_close_by()` to return an error when trying to
close the dbi descriptor of a table created and/or modified in a
still-running transaction. Such premature closure of the descriptor is
an incorrect use of the API and a violation of the contract/preconditions
formulated in the description of `mdbx_close_dbi()`.
However, instead of returning an error, an incorrect closure of the
descriptor was performed, which could lead to the creation of a table
with an empty name, leakage of database pages and/or corruption of a
b-tree structure (wrong reference to the root of a table).
The complete ChangeLog:
https://gitflic.ru/project/erthink/libmdbx/blob?file=ChangeLog.md
Signed-off-by: Леонид Юрьев (Leonid Yuriev) <leo@yuriev.ru>
Signed-off-by: Thomas Petazzoni <thomas.petazzoni@bootlin.com>
(cherry picked from commit 81e7806b93)
Signed-off-by: Peter Korsgaard <peter@korsgaard.com>
in e97fc89e7b a dependency on host-gcc >= 7 was added but
for the comment the condition was not correctly inverted.
Fixes: e97fc89e7b ("package/protobuf-c: bump to version 1.5.0")
Signed-off-by: Michael Nosthoff <buildroot@heine.tech>
Signed-off-by: Thomas Petazzoni <thomas.petazzoni@bootlin.com>
(cherry picked from commit 84ef9bede6)
Signed-off-by: Peter Korsgaard <peter@korsgaard.com>
When BR2_LINUX_KERNEL_IMAGE_TARGET_CUSTOM=y,
BR2_LINUX_KERNEL_IMAGE_TARGET_NAME is supposed to be non-empty. But in
the context of genraconfig, we don't know to what value
BR2_LINUX_KERNEL_IMAGE_TARGET_NAME can be set, so let's avoid cases
where BR2_LINUX_KERNEL_IMAGE_TARGET_CUSTOM=y. By dropping this option,
kconfig will revert back to the default image format for the selected
architecture.
Fixes:
http://autobuild.buildroot.net/results/1d104a051c83bb31e98565369a2ec7badfa21eca/
Signed-off-by: Thomas Petazzoni <thomas.petazzoni@bootlin.com>
(cherry picked from commit b07d21ab98)
Signed-off-by: Peter Korsgaard <peter@korsgaard.com>
Generating Bitcoins to an address can take longer than the current
timeout, on slow runners. This commit fixes this issue by increasing
the timeout on specific commands. This issue was also observed more
frequently on newer bitcoin-core version 28.0.
Fixes:
https://gitlab.com/buildroot.org/buildroot/-/jobs/7782083081
Signed-off-by: Julien Olivain <ju.o@free.fr>
Signed-off-by: Thomas Petazzoni <thomas.petazzoni@bootlin.com>
(cherry picked from commit 859c4ea5f7)
Signed-off-by: Peter Korsgaard <peter@korsgaard.com>
Since commit: https://git.postgresql.org/gitweb/?p=postgresql.git;a=commit;h=52afe563206e753f4c45c014fee2459ad0855826
postgrsql fails to build with toolchains without threads support:
misc.c: In function 'ecpg_gettext':
misc.c:541:51: error: 'PTHREAD_MUTEX_INITIALIZER' undeclared (first use in this function)
541 | static pthread_mutex_t binddomain_mutex = PTHREAD_MUTEX_INITIALIZER;
| ^~~~~~~~~~~~~~~~~~~~~~~~~
misc.c:541:51: note: each undeclared identifier is reported only once for each function it appears in
misc.c:552:24: warning: implicit declaration of function 'pthread_mutex_lock' [-Wimplicit-function-declaration]
552 | (void) pthread_mutex_lock(&binddomain_mutex);
| ^~~~~~~~~~~~~~~~~~
misc.c:569:24: warning: implicit declaration of function 'pthread_mutex_unlock' [-Wimplicit-function-declaration]
569 | (void) pthread_mutex_unlock(&binddomain_mutex);
| ^~~~~~~~~~~~~~~~~~~~
Option "--disable-thread-safety" will be dropped in PG 17, so
this patch is needed only for 16.x branch.
Fixes: 73dd1d6b96 ("package/postgresql: security bump version to 16.3")
Signed-off-by: Maxim Kochetkov <fido_max@inbox.ru>
Signed-off-by: Thomas Petazzoni <thomas.petazzoni@bootlin.com>
(cherry picked from commit 747a41c19c)
Signed-off-by: Peter Korsgaard <peter@korsgaard.com>
The package homepage http url redirects to https. This commit updates
this url to directly use https.
Signed-off-by: Julien Olivain <ju.o@free.fr>
Signed-off-by: Thomas Petazzoni <thomas.petazzoni@bootlin.com>
(cherry picked from commit 5440d6c446)
Signed-off-by: Peter Korsgaard <peter@korsgaard.com>
The package _SITE url only contains the latest version at a given point
in time. When a new version is published, it is replacing the old one.
This issue was not detected because the archive was downloaded from the
sources.buildroot.org backup mirror, when the primary source became
unavailable.
Since commit 559bb33ae "support/testing: do not use s.b.o" [1], the
runtime test infrastructure is disabling this backup mirror. This
makes the nmap runtime test failing [2], which is using liblinear as
a dependency.
The liblinear package author confirmed in a private email that all the
releases, including the latest version, are all kept in the "oldfiles"
directory.
This commit fixes this download issue by updating the _SITE url to that
location. While at it, this commit also change the url to use https
(since the http equivalent redirects to https).
Fixes:
- [2]
[1] https://gitlab.com/buildroot.org/buildroot/-/commit/559bb33ae71dd2358ca2314ccb24b56cc3809fc1
[2] https://gitlab.com/buildroot.org/buildroot/-/jobs/7948008007
Signed-off-by: Julien Olivain <ju.o@free.fr>
Signed-off-by: Thomas Petazzoni <thomas.petazzoni@bootlin.com>
(cherry picked from commit 8b18c67f26)
Signed-off-by: Peter Korsgaard <peter@korsgaard.com>
This fixes the following runtime error when importing PyQt5 in python:
from PyQt5.QtCore import *
ModuleNotFoundError: No module named 'PyQt5.sip'
The problem was likely triggered by the atomic upgrade from 5.7 to
5.15 in b36ce7e. This commit is part of the 2022-2024 LTS.
Signed-off-by: Ralf Dragon <hypnotoad@lindra.de>
Tested-by: Andreas Naumann <anaumann@ultratronik.de>
Signed-off-by: Julien Olivain <ju.o@free.fr>
(cherry picked from commit ba09a448f1)
[Peter: reword commit summary]
Signed-off-by: Peter Korsgaard <peter@korsgaard.com>
Version environment variable VERSION=$(VERSION) is set in the top level
Makefile of the sysvinit:
$(MAKE) VERSION=$(VERSION) -C src $@
Build command SYSVINIT_BUILD_CMDS doesn't use the top level Makefile, but
src/Makefile instead without setting the VERSION variable, which leads to
undefined VERSION macro in src/init.c.
Add VERSION=$(SYSVINIT_VERSION) to SYSVINIT_MAKE_OPTS to make the VERSION
environment variable available in the src/Makefile.
Signed-off-by: Cody Green <cody@londelec.com>
Signed-off-by: Thomas Petazzoni <thomas.petazzoni@bootlin.com>
(cherry picked from commit 954098b142)
Signed-off-by: Peter Korsgaard <peter@korsgaard.com>
The check-package tool requires some PyPi package to be installed before
it can run. This is typically done by manually installing them into the
user's global Python environment or setting up a virtual environment,
then manually installing each dependency.
Python recently defined a format for managing script dependencies as
inline metadata[1]. This can be used with the `uv` tool to run a Python
script and automatically install the minimum required version of Python
and PyPi dependencies.
With this change, it's now possible to run check-package with
uv run -s ./utils/check-package
Note that, because check-package does not have the '.py' file extension
we must specify the `-s` or `--script` argument. That argument was added
very recently in release 0.4.19[2].
I set the minimum python to 3.9 as that is the oldest version still
supported[3]. I verified 3.9 works by running
uv run -p 3.9 -s ./utils/check-package `git ls-tree -r --name-only HEAD` --ignore-list=.checkpackageignore
[1] https://packaging.python.org/en/latest/specifications/inline-script-metadata/#script-type
[2] https://github.com/astral-sh/uv/releases/tag/0.4.19
[3] https://devguide.python.org/versions/
Signed-off-by: Brandon Maier <brandon.maier@collins.com>
Signed-off-by: Thomas Petazzoni <thomas.petazzoni@bootlin.com>
(cherry picked from commit 6ffcdb52e8)
Signed-off-by: Peter Korsgaard <peter@korsgaard.com>
Call out the requirements to run check-package and mention that Docker
can be used to run check-package without installing dependencies.
Signed-off-by: Brandon Maier <brandon.maier@collins.com>
Signed-off-by: Thomas Petazzoni <thomas.petazzoni@bootlin.com>
(cherry picked from commit 68de69c4d7)
Signed-off-by: Peter Korsgaard <peter@korsgaard.com>
When compiling jailhouse with BR2_PACKAGE_JAILHOUSE_HELPER_SCRIPTS=y,
installation is failing with error:
/bin/sh: -c: line 1: syntax error near unexpected token ')'
This error is due to an extra ')' character in the macro
JAILHOUSE_INSTALL_HELPER_SCRIPTS.
This commit fixes this typo.
Signed-off-by: Raimundo Sagarzazu <rai.sagarzazu@outlook.com>
[Julien: reworded the commit log]
Signed-off-by: Julien Olivain <ju.o@free.fr>
(cherry picked from commit 10d25d98ed)
Signed-off-by: Peter Korsgaard <peter@korsgaard.com>
I still follow Buildroot development and use it for some personal
projects, but no longer have the time to be an active contributor.
Some of these are important defconfigs and packages to have up-to-date
in Buildroot, and mostly other developers have been doing that work, so
I am dropping them so that someone from the active contributors can be
the maintainer contact for them.
Signed-off-by: Erico Nunes <nunes.erico@gmail.com>
Signed-off-by: Thomas Petazzoni <thomas.petazzoni@bootlin.com>
(cherry picked from commit 1dc370cc90)
Signed-off-by: Peter Korsgaard <peter@korsgaard.com>
This vulnerability only affects libcurl deployments in Nest products
because of incorrect use.
Signed-off-by: Baruch Siach <baruch@tkos.co.il>
Signed-off-by: Thomas Petazzoni <thomas.petazzoni@bootlin.com>
(cherry picked from commit 7e739d49b2)
Signed-off-by: Peter Korsgaard <peter@korsgaard.com>
When I initially made the CVE cells collapsible, I neglected to
count the unsure CVEs. This patch adds unsure CVEs to the cell collapsing
calcualation to ensure that cells with lots of unsure CVEs actually get collapsed.
This patch also removes the "+ 1" from the cve_total calculation,
which fixes the cve_total being off-by-one.
I'm not sure *why* I did that in the first place.
demo:
https://sen-h.codeberg.page/pkg-stats-demos/@pages/add-unsure_cves-to-cve_total-calc.html
Signed-off-by: Sen Hastings <sen@hastings.org>
Signed-off-by: Thomas Petazzoni <thomas.petazzoni@bootlin.com>
(cherry picked from commit 87b8428c40)
Signed-off-by: Peter Korsgaard <peter@korsgaard.com>
Security fixes:
- gzip: prevent a hang when processing a malformed gzip inside a gzip
(#2366, OSS-Fuzz)
- tar: don't crash on truncated tar archives (#2364, OSS-Fuzz)
- tar: fix two leaks in tar header parsing (#2377)
Important bugfixes:
- 7-zip: read/write symlink paths as UTF-8 (#2252)
- cpio: exit with an error code if an entry could not be extracted (#2371)
- rar5: report encrypted entries (#2096)
- tar: fix truncation of entry pathnames in specific archives (#2360)
Signed-off-by: Francois Perrad <francois.perrad@gadz.org>
Signed-off-by: Thomas Petazzoni <thomas.petazzoni@bootlin.com>
(cherry picked from commit 55d0c9a9a6)
[Peter: mark as security bump]
Signed-off-by: Peter Korsgaard <peter@korsgaard.com>
The denx.de/wiki/U-Boot link now redirects to docs.u-boot.org/en/latest
Replace the link to the new location for the U-Boot documentation
Signed-off-by: Bryan Brattlof <bb@ti.com>
Signed-off-by: Thomas Petazzoni <thomas.petazzoni@bootlin.com>
(cherry picked from commit 164d9f0546)
Signed-off-by: Peter Korsgaard <peter@korsgaard.com>
Add a test that runs the dtc commandline tools. To test devicetree
compilation, we use an example devicetree from the dtc project. The
example source is GPL-2.0+ licensed.
Signed-off-by: Brandon Maier <brandon.maier@gmail.com>
Signed-off-by: Arnout Vandecappelle <arnout@mind.be>
(cherry picked from commit 9b69034160)
Signed-off-by: Peter Korsgaard <peter@korsgaard.com>
linux-pam 1.2.0 removed the use of yywrap, so the flex dependency is not
needed now (host-flex is still needed).
Fixes: #47
Signed-off-by: Damien Thébault <damien.thebault@gmail.com>
Signed-off-by: Arnout Vandecappelle <arnout@mind.be>
(cherry picked from commit 600e273487)
Signed-off-by: Peter Korsgaard <peter@korsgaard.com>
3.7.5 fixed a number of security issues:
fix multiple vulnerabilities identified by SAST (#2251, #2256)
cpio: ignore out-of-range gid/uid/size/ino and harden AFIO parsing (#2258)
lzop: prevent integer overflow (#2174)
rar4: protect copy_from_lzss_window_to_unp() (#2172, CVE-2024-20696)
rar4: fix CVE-2024-26256 (#2269, CVS-2024-26256)
rar4: fix OOB in delta and audio filter (#2148, #2149)
rar4: fix out of boundary access with large files (#2179)
rar4: add boundary checks to rgb filter (#2210)
rar4: fix OOB access with unicode filenames (#2203)
rar5: clear 'data ready' cache on window buffer reallocs (#2265)
rpm: calculate huge header sizes correctly (#2158)
unzip: unify EOF handling (#2175)
util: fix out of boundary access in mktemp functions (#2160)
uu: stop processing if lines are too long (#2168)
And 3.7.6 fixed a tar regression introduced in 3.7.5
Signed-off-by: Francois Perrad <francois.perrad@gadz.org>
Signed-off-by: Thomas Petazzoni <thomas.petazzoni@bootlin.com>
(cherry picked from commit ab3c84e5e2)
[Peter: mark as security bump]
Signed-off-by: Peter Korsgaard <peter@korsgaard.com>
Doctoring a defconfig is tedious, and it is not easy to update a
defconfig, as it requires manual copy-pasting, adding comments and so
on...
Instead, just require defconfigs to be generated with 'savedefconfig'.
Any details can/must be provided in the commit log.
Reported-by: Edgar Bonet <bonet@grenoble.cnrs.fr>
Signed-off-by: Yann E. MORIN <yann.morin.1998@free.fr>
Signed-off-by: Arnout Vandecappelle <arnout@mind.be>
(cherry picked from commit 17bdd10cb3)
Signed-off-by: Peter Korsgaard <peter@korsgaard.com>
Release notes: https://www.python.org/downloads/release/python-31110/
Fixes CVE-2024-4032, CVE-2024-6232, CVE-2024-6923, CVE-2024-7592,
CVE-2024-8088 and CVE-2023-27043.
The fixes for bundled libexpat are irrelevant for us because external expat
is used.
Signed-off-by: Peter Korsgaard <peter@korsgaard.com>
This version fixes an out-of-bound reads in the MLSD command, so upgrading is recommended.
It also improves compatibility with various systems.
Update the COPYING hash because of a change in copyright year
Signed-off-by: Michael Fischer <mf@go-sys.de>
Signed-off-by: Peter Korsgaard <peter@korsgaard.com>
(cherry picked from commit 5271e90a6a)
Signed-off-by: Peter Korsgaard <peter@korsgaard.com>
Also add a missing article one line above.
Signed-off-by: Peter Korsgaard <peter@korsgaard.com>
[Arnout: fix additional typo]
Signed-off-by: Arnout Vandecappelle <arnout@mind.be>
(cherry picked from commit 4390361bb5)
Signed-off-by: Peter Korsgaard <peter@korsgaard.com>
Upstream curl commit f057de5a1a950 ("libcurl.pc: add `Requires.private`,
`Requires` for static linking") deals with proper pkg-config
configuration since version 8.9.0.
Our local libcurl.pc modification we added back in commit 61d322c3d2
(package/cURL: fix static link whith openSSL) is no longer needed.
Signed-off-by: Baruch Siach <baruch@tkos.co.il>
[yann.morin.1998@free.fr: this is not a "revert", reword commit log]
Signed-off-by: Yann E. MORIN <yann.morin.1998@free.fr>
(cherry picked from commit a5cef5339b)
Signed-off-by: Peter Korsgaard <peter@korsgaard.com>
Commit 89d39fc7a3 "initscripts: new package" moved the inittab
packaged for Busybox init from system/skeleton/etc to package/busybox.
The manual, however, still points to the old location, so let's fix it.
Signed-off-by: Edgar Bonet <bonet@grenoble.cnrs.fr>
Signed-off-by: Yann E. MORIN <yann.morin.1998@free.fr>
(cherry picked from commit 99b1685fd8)
Signed-off-by: Peter Korsgaard <peter@korsgaard.com>
Signed-off-by: Peter Korsgaard <peter@korsgaard.com>
[yann.morin.1998@free.fr: s/contents/content/]
Signed-off-by: Yann E. MORIN <yann.morin.1998@free.fr>
(cherry picked from commit aa79ae24a8)
Signed-off-by: Peter Korsgaard <peter@korsgaard.com>
Commit a87abcf6da (Makefile: run PPD and RPATH fixup in host-fialize)
(sic) moved the fixups peviously done in prepare-sdk, to host-finalize.
This exposed a bug in fix-rpath, when RPATH contains multiple entries,
like: /PPD/host-foo/host/lib:/PPD/host-foo/host/lib/foo
In that situation, we want to get rid of /PPD/host-foo and replace it
with the finale HOST_DIR, so we mangle the RPATH with a sed expression.
However, that sed expression only ever replaces the first match, as it
is missing the 'g' option. Thus, the second (and following) parts of
RPATH are still referring to the PPD, and thus patchelf does not find it
relative to the final HOST_DIR, amd rops it. This eventually lead to a
final RPATH set as $ORIGIN/../lib instead of the expected
$ORIGIN/../lib:$ORIGIN/../lib/foo
This is the case for host-systemd, which installs some of its libraries
in $PREFIX/lib/systemd/ and adds an RPATH set appropriately to
/PPD/host-systemd/host/lib:/PPD/host-systemd/host/lib/systemd and that
gets incorrectly mangled.
Fixes: https://gitlab.com/buildroot.org/buildroot/-/issues/39
Also fix a typo in the comment just above.
Reported-by: José Luis Salvador Rufo @jlsalvador
Signed-off-by: Yann E. MORIN <yann.morin.1998@free.fr>
Tested-by: José Luis Salvador Rufo <salvador.joseluis@gmail.com>
Reviewed-by: José Luis Salvador Rufo <salvador.joseluis@gmail.com>
Tested-by: Adam Duskett <adam.duskett@amarulasolutions.com>
Reviewed-by: Adam Duskett <adam.duskett@amarulasolutions.com>
Signed-off-by: Peter Korsgaard <peter@korsgaard.com>
(cherry picked from commit 2100a76d9e)
Signed-off-by: Peter Korsgaard <peter@korsgaard.com>
Browsers nowadays complain about HTTP downloads (E.G. manual.pdf) from a
site served over HTTPS, so also use HTTPS for the nightly.buildroot.org
manual links.
Signed-off-by: Peter Korsgaard <peter@korsgaard.com>
(cherry picked from commit 06397d26a0)
Signed-off-by: Peter Korsgaard <peter@korsgaard.com>
The behaviour of asciidoc on my laptop (Debian 10.2.0-1) changed at the end
of last year, causing the BR2_VERSION logic to no longer work:
grep 'manual generated' buildroot-2023.02.*/docs/manual/manual.text
buildroot-2023.02.6/docs/manual/manual.text:Buildroot 2023.02.6 manual generated on 2023-10-16 08:41:26 UTC from
buildroot-2023.02.7/docs/manual/manual.text:Buildroot ${BR2_VERSION%%-git*} manual generated on 2023-11-14
buildroot-2023.02.8/docs/manual/manual.text:Buildroot ${BR2_VERSION%%-git*} manual generated on 2023-12-04
We don't really NEED to strip the -git suffix; indeed, for a git tag, there
would be not -git suffix, while for any other commit there will be one
and we want to see it (e.g. in the nightly manual, or on a development
branch locally).
So just drop that to unbreak the version output.
Signed-off-by: Peter Korsgaard <peter@korsgaard.com>
[yann.morin.1998@free.fr: explain why wew don't want to drop it]
Signed-off-by: Yann E. MORIN <yann.morin.1998@free.fr>
(cherry picked from commit ec270a0815)
Signed-off-by: Peter Korsgaard <peter@korsgaard.com>
The qemu.run() method can break when a command happens to output the
string "# " to stdout. This is because qemu.run() detects when a command
has completed by searching for the shell prompt, which by default is
"# ". It then captures everything before the "# " as the commands
output, causing the rest of output to be lost.
Instead use the pexpect libraries REPLWrapper to handle running
commands. It has hooks to set a custom prompt and avoid some other
pitfalls of wrapping a shell.
We unfortunately can't reuse replwrap._repl_sh directly, because it
tries to spawn a command while we already have a qemu started. So we
need to copy that code into _repl_sh_child. While we're at it, also
define our own prompt strings.
Signed-off-by: Brandon Maier <brandon.maier@collins.com>
[Arnout:
- Make all arguments to _repl_sh_spawn non-optional.
- Move non_printable_insert to a local variable instead of an argument,
we don't need to override it.
- Copy the comment from _repl_sh that explains why non_printable_insert
is needed.
- Add a comment about timeouts.
- Rename spawn to child (we don't actually spawn anything so this felt
more natural, even though the class
- Use single quotes instead of triple quotes, and explicitly escape the
nested quotes.
]
Signed-off-by: Arnout Vandecappelle <arnout@mind.be>
(cherry picked from commit 0cad947b96)
Signed-off-by: Peter Korsgaard <peter@korsgaard.com>
When the build host does not have a Python interpreter installed,
host-grub2 is failing to configure due to this missing interpreter.
Note that host-grub2 is the first package to fail because it is a
dependency of grub2. The grub2 target package has the same dependency
requirement.
The issue can be quickly reproduced on a host without Python with the
commands:
cat <<EOF >.config
BR2_aarch64=y
BR2_TARGET_GRUB2=y
BR2_TOOLCHAIN_EXTERNAL=y
EOF
make olddefconfig
make grub2
grub2 autotools configure.ac search for a Python interpreter since
upstream commit [1] 8b467844e "python: Use AM_PATH_PYTHON to determine
interpreter for gentpl.py", first included in grub v2.04 released
on 2019-07-04. For reference, grub2 has been updated to that version
in commit [2] ea7ec41c "boot/grub2: bump to verson 2.04".
This commit fixes the issue by adding the host-python3 dependency to
host-grub2 and grub2.
Fixes:
checking for a Python interpreter with version >= 2.6... none
configure: error: no suitable Python interpreter found
[1] https://git.savannah.gnu.org/gitweb/?p=grub.git;a=commitdiff;h=8b467844e11170077c8ca727c39d2bd36eeb5f08
[2] https://gitlab.com/buildroot.org/buildroot/-/commit/ea7ec41cf64e86a692ac45e0d012c6e8199ef110
Reported-by: Vincent Stehlé <vincent.stehle@arm.com>
Signed-off-by: Julien Olivain <ju.o@free.fr>
Signed-off-by: Yann E. MORIN <yann.morin.1998@free.fr>
(cherry picked from commit 86bb1b2360)
Signed-off-by: Peter Korsgaard <peter@korsgaard.com>
Samuel Martin has not been around in the Buildroot community for many,
many years. His last posting on the mailing list was on July 2018. So
let's not pretend those packages are actually maintained, and let's
stop spamming Samuel with lots of patches and autobuilder failures.
Signed-off-by: Thomas Petazzoni <thomas.petazzoni@bootlin.com>
Signed-off-by: Yann E. MORIN <yann.morin.1998@free.fr>
(cherry picked from commit d8b83b861c)
Signed-off-by: Peter Korsgaard <peter@korsgaard.com>
Fixes the following CVEs:
CVE-2024-24789: archive/zip: mishandling of corrupt central directory record
CVE-2024-24790: net/netip: unexpected behavior from Is methods for IPv4-mapped IPv6 addresses
View the release notes for more information:
https://go.dev/doc/devel/release#go1.22.4
Signed-off-by: Christian Stewart <christian@aperture.us>
Signed-off-by: Peter Korsgaard <peter@korsgaard.com>
(cherry picked from commit d6e0f1b622)
Signed-off-by: Peter Korsgaard <peter@korsgaard.com>
Add a third bootstrap stage with Go1.21.x necessary for go1.22 bootstrap.
go-bootstrap-stage1 is Go1.4.x, the final version to support bootstrap using a C
compiler (later versions require the Go compiler for bootstrapping).
See: https://go.dev/doc/install/source#bootstrapFromSource
go-bootstrap-stage2 is Go 1.19.13, the last version to support bootstrap using
the Go1.4.x compiler.
go-bootstrap-stage3 is Go 1.21.8, the last version to support bootstrap using
the Go1.19.13 compiler. Go 1.20 requires a minimum of go 1.17.13 to bootstrap.
See: https://go.dev/doc/go1.20#bootstrap
This patch is in preparation for bumping the host-go package to >go1.22.x, which
requires a minimum of Go1.20.x for bootstrap.
See: https://go.dev/doc/go1.22#bootstrap
Signed-off-by: Christian Stewart <christian@aperture.us>
[Arnout: add GOCACHE definition]
Signed-off-by: Arnout Vandecappelle <arnout@mind.be>
(cherry picked from commit f00eb37de9)
Signed-off-by: Peter Korsgaard <peter@korsgaard.com>
Rewrap the whole help text as with the typo fix the line is a bit
longer and no longer fits within the limits defined by our
check-package coding style checking.
Signed-off-by: Peter Korsgaard <peter@korsgaard.com>
Signed-off-by: Thomas Petazzoni <thomas.petazzoni@bootlin.com>
(cherry picked from commit 08926081d8)
Signed-off-by: Peter Korsgaard <peter@korsgaard.com>
WirePlumber is a PipeWire session manager, essential to the operation
of PipeWire in most use cases. It is not a graphical application,
nor does it support graphics in any way. It is only there to support
PipeWire and it should be kept together with PipeWire in the menus.
Signed-off-by: George Kiagiadakis <george.kiagiadakis@collabora.com>
Signed-off-by: Arnout Vandecappelle <arnout@mind.be>
(cherry picked from commit 14b1b8ca8d)
Signed-off-by: Peter Korsgaard <peter@korsgaard.com>
The two lines with the Buildroot version and the system os-release
details are rendered on a single line, "because Markdown".
Make that a two-item list, to be sure they are on properly rendered.
Signed-off-by: Yann E. MORIN <yann.morin.1998@free.fr>
(cherry picked from commit 6a1e297a31)
Signed-off-by: Peter Korsgaard <peter@korsgaard.com>
Signed-off-by: Peter Korsgaard <peter@korsgaard.com>
[yann.morin.1998@free.fr: also fix grammar]
Signed-off-by: Yann E. MORIN <yann.morin.1998@free.fr>
(cherry picked from commit e009783505)
Signed-off-by: Peter Korsgaard <peter@korsgaard.com>
Currently, the gdbinit is generated and installed during post install
hooks, either from the gdb package, or from the external-toolchain
package. When using per-package directories (PPD), the staging directory
of the either package is stored in the generated gdbinit, which is not
going to be valid when all the PPD staging dirs get merged into the
final staging: it would lack any library installed afterwards, i.e.
mostly everything would be missing (but the libraries from the C
toolchain in the case of an external toolchain).
Similarly, all the RPATH will point to various PPD drectories. This
does not cause any issue when the final host is aggregated, because the
PPD directories still exist when we call programs from there (e.g. from
the fs infra, or from post-image scripts).
However, we knew that would not always be possible to keep the PPD
directories: we have the prepare-sdk rule that runs a cleanup pass on
the RPATH, and also applies the generic PPD fixups.
When we introduced prepare-sdk in c32ad51cbf (core/sdk: generate the
SDK tarball ourselves), we did not yet have support for PPD for the host
directory, and especially, we did not have the host-finalize rule, which
was only introduced in d0f4f95e39 (Makefile: rework main directory
creation logic) which kick-started the introduction of PPD.
At that point, we did not realise that the rpath fixups from
prepare-sdk, would be better moved to the new host-finalize rule,
because that had no impact unless one would need an SDK.
Later, in 25e60fbe1c (Makefile: fix SDK relocation for
per-package-dirs), we eventually introduced the PPD generic fixups in
the prepare-sdk rule. Again, we did not realise that those fixups would
be better placed in the host-finalize rule rather than the prepare-sdk.
While fixing the RPATH in host-finalize is not critical, fixing up the
PPD paths actually is, as the gdbinit case demonstrate.
As such, move the PPD fixups to the host-finalize step, and while at it,
also move the RPATH fixups.
This now does not leave much to do in the prepare-sdk step, and that
could very well be moved to the host-finalize rule as well. However,
some people may have started to rely on prepare-sdk in its 6 years of
existence, and the little script it installs is not needed unless one
really needs an SDK. So leave it as it is for now.
Reported-by: Casey Reeves <casey@xogium.me>
Signed-off-by: Yann E. MORIN <yann.morin.1998@free.fr>
Tested-by: Casey Reeves <casey@xogium.me>
Cc: Thomas Petazzoni <thomas.petazzoni@bootlin.com>
Cc: Brandon Maier <Brandon.Maier@collins.com>
Tested-by: Brandon Maier <brandon.maier@collins.com>
Acked-by: TIAN Yuanhao <tianyuanhao3@163.com>
(cherry picked from commit a87abcf6da)
Signed-off-by: Peter Korsgaard <peter@korsgaard.com>
Following an email exchange with Conrad Sand, one of the maintainers of
the project, I learned that version 9.900.2 has been moved to
https://sourceforge.net/projects/arma/files/retired/.
This patch fixes the package download error, waiting for a subsequent
patch that will restore the previous URL to bump to a more recent
version.
Adding the .RETIRED suffix to the downloaded tarball generated the
following error:
armadillo-9.900.2.tar.xz.RETIRED: OK (sha256: d78658c9442addf7f718eb05881150ee3ec25604d06dd3af4942422b3ce26d05)
>>> armadillo 9.900.2 Extracting
buildroot/dl/armadillo/armadillo-9.900.2.tar.xz.RETIRED | buildroot/output/host/bin/tar --strip-components=1 -C buildroot/output/build/armadillo-9.900.2 -xf -
/bin/bash: line 1: buildroot/dl/armadillo/armadillo-9.900.2.tar.xz.RETIRED: Permission denied
buildroot/output/host/bin/tar: This does not look like a tar archive
buildroot/output/host/bin/tar: Exiting with failure status due to previous errors
make[1]: *** [package/pkg-generic.mk:213: buildroot/output/build/armadillo-9.900.2/.stamp_extracted] Error 2
which required the addition of ARMADILLO_EXTRACT_CMDS to be fixed.
Finally, it was also necessary to modify the tarball's hash.
Fixes:
- http://autobuild.buildroot.org/results/d4e9e7b453960a4f62a199344b30b729a4f235bc
Signed-off-by: Dario Binacchi <dario.binacchi@amarulasolutions.com>
Signed-off-by: Thomas Petazzoni <thomas.petazzoni@bootlin.com>
(cherry picked from commit f69fe48404)
Signed-off-by: Peter Korsgaard <peter@korsgaard.com>
Patch v1 not set to 'superseded' when replying to <message-id> with v2.
I'm using git version 2.46.0. The manual says the following is the
correct way to use the '--in-reply-to' option:
git send-email --in-reply-to=<message-id>
Signed-off-by: Roy Kollen Svendsen <roykollensvendsen@gmail.com>
Signed-off-by: Thomas Petazzoni <thomas.petazzoni@bootlin.com>
(cherry picked from commit 6677d9c4e1)
Signed-off-by: Peter Korsgaard <peter@korsgaard.com>
Replace the group name 'nogroup' with 'nobody' in the default ProFTPD
configuration file. This fixes the following error when starting the
server:
proftpd[110]: fatal: Group: Unknown group 'nogroup' on line 30 of '/etc/proftpd.conf'
Fixes: 0d887cc2b4 ("system: replace nogroup with nobody")
Signed-off-by: Mattia Narducci <mattianarducci1@gmail.com>
Signed-off-by: Peter Korsgaard <peter@korsgaard.com>
(cherry picked from commit 2383768cdf)
Signed-off-by: Peter Korsgaard <peter@korsgaard.com>
Fixes the following security issues:
- CVE-2024-31080: Heap buffer overread/data leakage in ProcXIGetSelectedEvents
- CVE-2024-31081: Heap buffer overread/data leakage in ProcXIPassiveGrabDevice
- CVE-2024-31082: Heap buffer overread/data leakage in ProcAppleDRICreatePixmap
- CVE-2024-31083: User-after-free in ProcRenderAddGlyphs
For more details, see thee security page of Xorg:
https://www.x.org/wiki/Development/Security/
Signed-off-by: Waldemar Brodkorb <wbx@openadk.org>
[Peter: add actual list of CVEs]
Signed-off-by: Peter Korsgaard <peter@korsgaard.com>
(cherry picked from commit e33db30aab)
Signed-off-by: Peter Korsgaard <peter@korsgaard.com>
I lack the time (and interest) to properly keep these entries up to
date, so drop them from my section.
Signed-off-by: Thomas Huth <huth@tuxfamily.org>
Signed-off-by: Thomas Petazzoni <thomas.petazzoni@bootlin.com>
(cherry picked from commit 6fdbab87a2)
Signed-off-by: Peter Korsgaard <peter@korsgaard.com>
The following build failure on xtensa:
Waf: Entering directory `/home/buildroot/instance-0/output-1/build/ntpsec-1.2.3/build/host'
[1/2] Processing ntpd/ntp_parser.y
[2/2] Compiling build/host/ntpd/ntp_parser.tab.c
gcc: error: unrecognized command-line option '-mlongcalls'
gcc: error: unrecognized command-line option '-mauto-litpools'
reveals that the target's CFLAGS are being used for host compilation.
The patch fixes the host compilation by correctly setting the CFLAGS to
be used.
It should be noted that the build script used by ntpsec applies CFLAGS
for host compilation and --cross-cflags for target compilation.
Fixes:
- http://autobuild.buildroot.org/results/9321a637f2c340ce8dcb24249676bb6c44d0dfc6
Signed-off-by: Dario Binacchi <dario.binacchi@amarulasolutions.com>
Signed-off-by: Thomas Petazzoni <thomas.petazzoni@bootlin.com>
(cherry picked from commit 064e4c09fa)
Signed-off-by: Peter Korsgaard <peter@korsgaard.com>
Disable RNG support so that following build failure does not happen:
In file included from ../../../../src/libstrongswan/plugins/plugin.h:28,
from wolfssl_plugin.h:34,
from wolfssl_plugin.c:29:
wolfssl_plugin.c: In function 'get_features':
../../../../src/libstrongswan/plugins/plugin_feature.h:321:119: error: 'FEATURE_WC_RNG' undeclared (first use in this function); did you mean 'FEATURE_RNG'?
321 | #define __PLUGIN_FEATURE_REGISTER(type, _f) (plugin_feature_t){ FEATURE_REGISTER, FEATURE_##type, .arg.reg.f = _f }
| ^~~~~~~~
../../../../src/libstrongswan/plugins/plugin_feature.h:332:73: note: in expansion of macro '__PLUGIN_FEATURE_REGISTER'
332 | #define _PLUGIN_FEATURE_REGISTER_RNG(type, f) __PLUGIN_FEATURE_REGISTER(type, f)
| ^~~~~~~~~~~~~~~~~~~~~~~~~
../../../../src/libstrongswan/plugins/plugin_feature.h:248:39: note: in expansion of macro '_PLUGIN_FEATURE_REGISTER_RNG'
248 | #define PLUGIN_REGISTER(type, f, ...) _PLUGIN_FEATURE_REGISTER_##type(type, f, ##__VA_ARGS__)
| ^~~~~~~~~~~~~~~~~~~~~~~~~
wolfssl_plugin.c:510:17: note: in expansion of macro 'PLUGIN_REGISTER'
510 | PLUGIN_REGISTER(RNG, wolfssl_rng_create),
| ^~~~~~~~~~~~~~~
../../../../src/libstrongswan/plugins/plugin_feature.h:321:119: note: each undeclared identifier is reported only once for each function it appears in
321 | #define __PLUGIN_FEATURE_REGISTER(type, _f) (plugin_feature_t){ FEATURE_REGISTER, FEATURE_##type, .arg.reg.f = _f }
| ^~~~~~~~
../../../../src/libstrongswan/plugins/plugin_feature.h:332:73: note: in expansion of macro '__PLUGIN_FEATURE_REGISTER'
332 | #define _PLUGIN_FEATURE_REGISTER_RNG(type, f) __PLUGIN_FEATURE_REGISTER(type, f)
| ^~~~~~~~~~~~~~~~~~~~~~~~~
../../../../src/libstrongswan/plugins/plugin_feature.h:248:39: note: in expansion of macro '_PLUGIN_FEATURE_REGISTER_RNG'
248 | #define PLUGIN_REGISTER(type, f, ...) _PLUGIN_FEATURE_REGISTER_##type(type, f, ##__VA_ARGS__)
| ^~~~~~~~~~~~~~~~~~~~~~~~~
wolfssl_plugin.c:510:17: note: in expansion of macro 'PLUGIN_REGISTER'
510 | PLUGIN_REGISTER(RNG, wolfssl_rng_create),
| ^~~~~~~~~~~~~~~
make[6]: *** [Makefile:659: wolfssl_plugin.lo] Error 1
Reported Upstream:
https://github.com/strongswan/strongswan/issues/2410
This build failure started since 5.9.11 update in commit
78959665b9.
Fixes:
http://autobuild.buildroot.net/results/278b3f74c48c858ae368d59069752adb69c05246
Signed-off-by: Waldemar Brodkorb <wbx@openadk.org>
Signed-off-by: Thomas Petazzoni <thomas.petazzoni@bootlin.com>
(cherry picked from commit 89d512729c)
Signed-off-by: Peter Korsgaard <peter@korsgaard.com>
Commit 8f88a644ed "support/scripts/apply-patches.sh: set the maximum
fuzz factor to 0" reduced the fuzz factor.
Due to this change, asterisk fails to build with output:
Applying 0004-install-samples-need-the-data-files.patch using patch:
patching file Makefile
Hunk #1 FAILED at 779.
1 out of 1 hunk FAILED -- saving rejects to file Makefile.rej
This commit rebase the package patches on the current package version.
Note: the patch 0005 is unchanged, as it is correct in its current
state.
Fixes:
- http://autobuild.buildroot.org/results/92d/92d58ecb67f11a6eb74695bc1efcc672f69a57a9
Signed-off-by: Julien Olivain <ju.o@free.fr>
Signed-off-by: Yann E. MORIN <yann.morin.1998@free.fr>
(cherry picked from commit a6fabd9610)
Signed-off-by: Peter Korsgaard <peter@korsgaard.com>
Commit 2f260084d5 (utils/genrandconfig: remove support for toolchain
CSV) kept the --no-toolchains-csv option, but in the rework forgot to
keep it as a bool, while argparse default is to expect a string.
Rather than re-introduce the action="store_true" which implies the
argument is a bool, explicit make it a bool.
Fixes: 2f260084d5
Reported-by: James Hilliard <james.hilliard1@gmail.com>
Signed-off-by: Yann E. MORIN <yann.morin.1998@free.fr>
Cc: Thomas Petazzoni <thomas.petazzoni@bootlin.com>
Signed-off-by: Thomas Petazzoni <thomas.petazzoni@bootlin.com>
(cherry picked from commit 4dbb87bb66)
Signed-off-by: Peter Korsgaard <peter@korsgaard.com>
Right now, genrandconfig just spits out the random messages from the
different make invocations, which isn't terribly useful. Instead,
let's redirect the output of make invocations to oblivion, and add
some more high level logging.
As part of this logging, we're interested to see how many iterations
were needed to find a valid configuration, so changed the loop logic
to count from 0 to 100 instead of from 100 to 0 so that we can easily
show the iteration number.
Signed-off-by: Thomas Petazzoni <thomas.petazzoni@bootlin.com>
Signed-off-by: Yann E. MORIN <yann.morin.1998@free.fr>
(cherry picked from commit ce3dedc26b)
Signed-off-by: Peter Korsgaard <peter@korsgaard.com>
In order to test that upstream sites are still working, we need to NOT
fallback to sources.buildroot.net for some builds.
As there is anyway a local cache in the autobuilder instances, we need
to do quite a lot of builds without any BR2_BACKUP_SITE configured to
have a chance to catch issues, which is why a 50% chance is used to
unset BR2_BACKUP_SITE.
Signed-off-by: Thomas Petazzoni <thomas.petazzoni@bootlin.com>
Signed-off-by: Yann E. MORIN <yann.morin.1998@free.fr>
(cherry picked from commit da5c25c9f9)
Signed-off-by: Peter Korsgaard <peter@korsgaard.com>
Before calling randpackageconfig/randconfig, we were pre-generating a
snippet of .config with:
(1) minimal.config
(2) BR2_CURL/BR2_WGET settings
(3) some random selection of init system, debug, runtime debug, etc
(4) enabling BR2_REPRODUCIBLE=y when diffoscope was found
Now that we only use randconfig, this whole fine-tuning is completely
irrelevant, as it gets overridden by "make randconfig".
(1) and (3) above are useless, as randconfig does all the
randomization that is needed.
However, we want to preserve (2) and (4) above, so we re-implement
those fixups, but *after* randconfig has done its job.
Signed-off-by: Thomas Petazzoni <thomas.petazzoni@bootlin.com>
Signed-off-by: Yann E. MORIN <yann.morin.1998@free.fr>
(cherry picked from commit 3d33d394c2)
Signed-off-by: Peter Korsgaard <peter@korsgaard.com>
Now that the support for generating a fully random configuration has
been well-tested, the whole mechanism based on a toolchain CSV isn't
really useful anymore, so let's drop it to simplify the logic.
Note that the autobuilder code still uses --{,no-}toolchains-csv, so we
can't remove those or the autobuilders would fail. Once all supported
branches no longer use those argumetns, we can drop them from the
autobuilder code, then ask people to update their runners, and we will
finally be able to drop those arguments. Eventually.
Signed-off-by: Thomas Petazzoni <thomas.petazzoni@bootlin.com>
[yann.morin.1998@free.fr: keep --{,no-}toolchains-csv and explain why]
Signed-off-by: Yann E. MORIN <yann.morin.1998@free.fr>
(cherry picked from commit 2f260084d5)
Signed-off-by: Peter Korsgaard <peter@korsgaard.com>
We have accumulated a whole bunch of very old fixups to avoid issues
with super old CT-NG toolchains, which we are not testing anymore, so
remove those fixups.
Signed-off-by: Thomas Petazzoni <thomas.petazzoni@bootlin.com>
Signed-off-by: Yann E. MORIN <yann.morin.1998@free.fr>
(cherry picked from commit 9e33882568)
Signed-off-by: Peter Korsgaard <peter@korsgaard.com>
The LICENSE file gets installed directly to the root of $(TARGET_DIR),
which clashes with other packages:
FileExistsError: File already exists: /home/autobuild/autobuild/instance-3/output-1/target/LICENSE
This commit fixes this issue for the python-unittest-xml-reporting
package. Other fixes will be needed for the other patches.
The issue in python-unittest-xml-reporting was introduced in upstream
commit c43427611390fba83ca13fbb5311bd8fece5048f, which first appeared
in v3.1.0. We switched from a pre-3.1.0 version to 3.2.0 in Buildroot
in commit 69ba1562d5, which was merged
in 2023.02.
Fixes:
http://autobuild.buildroot.net/results/2c91243b440087bbc7d051d65f553f59d05dd207/
Signed-off-by: Thomas Petazzoni <thomas.petazzoni@bootlin.com>
Signed-off-by: Yann E. MORIN <yann.morin.1998@free.fr>
(cherry picked from commit 182d3556a6)
Signed-off-by: Peter Korsgaard <peter@korsgaard.com>
The python-huepy has an incorrect data_files statement in its
setup.py, causing the LICENSE file to be installed directly as
$(TARGET_DIR)/LICENSE. This was detected because several packages were
doing this, and the second package doing
it (python-unittest-xml-reporting, fixed separately) was erroring out
when trying to overwrite this already existing file.
This commit fixes the case of python-huepy by adding a patch that has
been submitted upstream.
There are no autobuilder failures related to python-huepy, but this
was detected while fixing
http://autobuild.buildroot.net/results/2c91243b440087bbc7d051d65f553f59d05dd207/
for python-unittest-xml-reporting.
This bug has been in huepy since at least 2018, so this patch can be
backported to previous Buildroot versions.
Signed-off-by: Thomas Petazzoni <thomas.petazzoni@bootlin.com>
Signed-off-by: Yann E. MORIN <yann.morin.1998@free.fr>
(cherry picked from commit 4e78b2c8b1)
Signed-off-by: Peter Korsgaard <peter@korsgaard.com>
lib/print.c in gnu-efi contains some floating point computation. On
ARM soft-float configurations, these floating point operations
generate calls to __eabi_*() functions that are provided by
gcc. However, gnu-efi builds some freestanding code, so it doesn't
link with libgcc, and therefore the build fails with:
arm-buildroot-linux-gnueabi-ld: /output-1/build/gnu-efi-3.0.18//lib/print.c:1431:(.text+0x78c): undefined reference to `__aeabi_i2d'
arm-buildroot-linux-gnueabi-ld: /output-1/build/gnu-efi-3.0.18//lib/print.c:1431:(.text+0x7a0): undefined reference to `__aeabi_dsub'
arm-buildroot-linux-gnueabi-ld: /output-1/build/gnu-efi-3.0.18//lib/print.c:1431:(.text+0x7a4): undefined reference to `__aeabi_d2f'
arm-buildroot-linux-gnueabi-ld: /output-1/build/gnu-efi-3.0.18//lib/print.c:1432:(.text+0x7b4): undefined reference to `__aeabi_fcmplt'
arm-buildroot-linux-gnueabi-ld: /output-1/build/gnu-efi-3.0.18//lib/print.c:1438:(.text+0x7c8): undefined reference to `__aeabi_fmul'
arm-buildroot-linux-gnueabi-ld: /output-1/build/gnu-efi-3.0.18//lib/print.c:1440:(.text+0x7d4): undefined reference to `__aeabi_fcmpeq'
arm-buildroot-linux-gnueabi-ld: /output-1/build/gnu-efi-3.0.18//lib/print.c:1444:(.text+0x7f8): undefined reference to `__aeabi_fmul'
arm-buildroot-linux-gnueabi-ld: /output-1/build/gnu-efi-3.0.18//lib/print.c:1440:(.text+0x808): undefined reference to `__aeabi_fcmpeq'
arm-buildroot-linux-gnueabi-ld: /output-1/build/gnu-efi-3.0.18//lib/print.c:1440:(.text+0x818): undefined reference to `__aeabi_f2iz'
arm-buildroot-linux-gnueabi-ld: /output-1/build/gnu-efi-3.0.18//lib/print.c:1451:(.text+0x834): undefined reference to `__aeabi_i2f'
arm-buildroot-linux-gnueabi-ld: /output-1/build/gnu-efi-3.0.18//lib/print.c:1451:(.text+0x840): undefined reference to `__aeabi_fcmpeq'
arm-buildroot-linux-gnueabi-ld: /output-1/build/gnu-efi-3.0.18//lib/print.c:1453:(.text+0x858): undefined reference to `__aeabi_fmul'
arm-buildroot-linux-gnueabi-ld: /output-1/build/gnu-efi-3.0.18//lib/print.c:1451:(.text+0x860): undefined reference to `__aeabi_f2iz'
arm-buildroot-linux-gnueabi-ld: /output-1/build/gnu-efi-3.0.18//lib/print.c:1451:(.text+0x868): undefined reference to `__aeabi_i2f'
arm-buildroot-linux-gnueabi-ld: /output-1/build/gnu-efi-3.0.18//lib/print.c:1451:(.text+0x870): undefined reference to `__aeabi_fcmpeq'
arm-buildroot-linux-gnueabi-ld: /output-1/build/gnu-efi-3.0.18//lib/print.c:1451:(.text+0x89c): undefined reference to `__aeabi_f2iz'
Since we don't care about gnu-efi support on ARM soft-float
configurations, let's disable such configurations.
Note that we have chosen to use BR2_ARM_SOFT_FLOAT as we're for now
making this specific to ARM as we're not sure what is the situation on
other CPU architectures (for example RISC-V without FPU maybe). This
can be revisited once we get more data on the behavior on other CPU
architectures that can support soft-float.
Fixes:
http://autobuild.buildroot.net/results/98d955fd2fcf4a3db1ab46e4f553447031a23b92/
Signed-off-by: Thomas Petazzoni <thomas.petazzoni@bootlin.com>
Signed-off-by: Yann E. MORIN <yann.morin.1998@free.fr>
(cherry picked from commit b62f2f7f12)
Signed-off-by: Peter Korsgaard <peter@korsgaard.com>
Since the bump of gnu-efi to version 3.0.17 in Buildroot commit
fa9893ad8f, the build of gnu-efi fails
on ARM big endian and AArch64 big endian.
Indeed, since that bump, gnu-efi builds some "apps", using a special
linker file part of gnu-efi that explicitly sets the architecture:
OUTPUT_FORMAT("elf32-littlearm", "elf32-littlearm", "elf32-littlearm")
OUTPUT_FORMAT("elf64-littleaarch64", "elf64-littleaarch64", "elf64-littleaarch64")
Due to this, big endian builds are now failing:
armeb-buildroot-linux-gnueabi-ld: ../gnuefi/crt0-efi-arm.o: compiled for a big endian system and target is little endian
armeb-buildroot-linux-gnueabi-ld: failed to merge target specific data of file ../gnuefi/crt0-efi-arm.o
Since we are not really interested in supporting gnu-efi on ARM big
endian and AArch64 big endian and it is not supported upstream, let's
disabled on those architectures.
Fixes:
http://autobuild.buildroot.org/results/4d385d6759346e19664d0bded1e419f004f82b47/ (ARM big endian)
http://autobuild.buildroot.net/results/b6df43408ca4cd469962c96d49d9ac7935b6dbe9/ (AArch64 big endian)
Signed-off-by: Thomas Petazzoni <thomas.petazzoni@bootlin.com>
Signed-off-by: Yann E. MORIN <yann.morin.1998@free.fr>
(cherry picked from commit 308d2c9927)
Signed-off-by: Peter Korsgaard <peter@korsgaard.com>
Changes with nginx 1.26.2 14 Aug 2024
*) Security: processing of a specially crafted mp4 file by the
ngx_http_mp4_module might cause a worker process crash
(CVE-2024-7347).
Thanks to Nils Bars.
Signed-off-by: Waldemar Brodkorb <wbx@openadk.org>
Signed-off-by: Thomas Petazzoni <thomas.petazzoni@bootlin.com>
(cherry picked from commit 8f31fea6d0)
Signed-off-by: Peter Korsgaard <peter@korsgaard.com>
Fixes the following security issues:
- gh-115398: Allow controlling Expat >=2.6.0 reparse deferral
(CVE-2023-52425) by adding five new methods:
xml.etree.ElementTree.XMLParser.flush()
xml.etree.ElementTree.XMLPullParser.flush()
xml.parsers.expat.xmlparser.GetReparseDeferralEnabled()
xml.parsers.expat.xmlparser.SetReparseDeferralEnabled()
xml.sax.expatreader.ExpatParser.flush()
- gh-115243: Fix possible crashes in collections.deque.index() when the
deque is concurrently modified.
- gh-114572: ssl.SSLContext.cert_store_stats() and
ssl.SSLContext.get_ca_certs() now correctly lock access to the certificate
store, when the ssl.SSLContext is shared across multiple threads.
For more details, see the changelog:
https://docs.python.org/release/3.11.9/whatsnew/changelog.html#python-3-11-9
Signed-off-by: Peter Korsgaard <peter@korsgaard.com>
This commit backports two upstream patches needed to fix
CVE-2023-34410. According to the CVE details, both patches are needed
for the fix.
Signed-off-by: Thomas Petazzoni <thomas.petazzoni@bootlin.com>
Signed-off-by: Peter Korsgaard <peter@korsgaard.com>
This commit backports upstream patches that are needed to fix
CVE-2023-37369. The second one is the actual CVE fix, the first one is
needed to only backporting the second patch in a reasonable way.
Signed-off-by: Thomas Petazzoni <thomas.petazzoni@bootlin.com>
Signed-off-by: Peter Korsgaard <peter@korsgaard.com>
This commit backports upstream patches that are needed to fix
CVE-2023-51714. The second one is the actual CVE fix, the first one is
needed to only backporting the second patch in a reasonable way.
Signed-off-by: Thomas Petazzoni <thomas.petazzoni@bootlin.com>
Signed-off-by: Peter Korsgaard <peter@korsgaard.com>
This commit backports an upstream patch to fix CVE-2023-38197, which
requires 3 other patches to be backported in order to work properly.
Signed-off-by: Thomas Petazzoni <thomas.petazzoni@bootlin.com>
Signed-off-by: Peter Korsgaard <peter@korsgaard.com>
This commit backports some upstream commits to fix CVE-2023-32763.
To backport the CVE fix, we had to backport two other related patches
to make the backport reasonably clean/straightforward.
Signed-off-by: Thomas Petazzoni <thomas.petazzoni@bootlin.com>
Signed-off-by: Peter Korsgaard <peter@korsgaard.com>
Fixes:
http://autobuild.buildroot.net/results/94fd27ea48c4128033ad10cf0dc5dba3f5d97a02/
Commit 4aff9fae45 (package/am335x-pru-package: fix download
issue) updated the filename and hash of the package, but something went
wrong when adjusting the hash for 2024.02.x.
Investigating the local tarball shows that the permissions in the tarball were
were wrong:
diffoscope old-dl/am335x-pru-package/am335x-pru-package-5f374*-br1.tar.gz \
dl/am335x-pru-package/am335x-pru-package-5f374*-br1.tar.gz | \
grep 96/.gitignore
│ │ --rw-rw-rw- 0 0 0 199 2016-02-10 20:56:25.000000 am335x-pru-package-5f374ad57cc195f28bf5e585c3d446aba6ee7096/.gitignore
│ │ +-rw-r--r-- 0 0 0 199 2016-02-10 20:56:25.000000 am335x-pru-package-5f374ad57cc195f28bf5e585c3d446aba6ee7096/.gitignore
And indeed, the file does have mode 666 in the git repo:
ls -lah old-dl/am335x-pru-package/git/.gitignore
-rw-rw-rw- 1 peko peko 199 Aug 31 18:16 old-dl/am335x-pru-package/git/.gitignore
It is unclear how this happened, maybe an issue with switching between
master/2024.05.x/2024.02.x.
Adjust the hash to match what is should have been instead.
Signed-off-by: Peter Korsgaard <peter@korsgaard.com>
The download and homepage URL for this project have been
updated. The old site no longer works.
Signed-off-by: Waldemar Brodkorb <wbx@openadk.org>
Signed-off-by: Thomas Petazzoni <thomas.petazzoni@bootlin.com>
(cherry picked from commit 2a547e2c42)
Signed-off-by: Peter Korsgaard <peter@korsgaard.com>
Commit 9f94b3b354 "package/iperf3: bump to version 3.16" updated
the package but forgot to reflect a breaking change mentioned in
the release note [1], "iperf3 now requires pthreads and C atomic
variables to compile and run".
When the toolchain has no atomic support, or the libatomic is not
added in the linker flags, the compilation now fail with output:
arm-buildroot-linux-gnueabi/bin/ld: ./.libs/libiperf.so: undefined reference to '__atomic_load_8'
This issue can be seen when running the iperf3 runtime test, with
command:
support/testing/run-tests \
-d dl -o output_test \
tests.package.test_iperf3
This commit fixes the issue by adding a dependency on
BR2_TOOLCHAIN_HAS_ATOMIC and by adding an upstream patch to detect
if linking to libatomic is needed.
Fixes: [2]
[1] https://github.com/esnet/iperf/releases/tag/3.16
[2] https://gitlab.com/buildroot.org/buildroot/-/jobs/6466933622
Signed-off-by: Julien Olivain <ju.o@free.fr>
Signed-off-by: Yann E. MORIN <yann.morin.1998@free.fr>
(cherry picked from commit f10488a411)
Signed-off-by: Peter Korsgaard <peter@korsgaard.com>
Django 5.0.7 fixes the following CVEs:
* CVE-2024-38875: Potential denial-of-service vulnerability in django.utils.html.urlize()
* CVE-2024-39329: Username enumeration through timing difference for users with unusable passwords
* CVE-2024-39330: Potential directory-traversal via Storage.save()
* CVE-2024-39614: Potential denial-of-service vulnerability in get_supported_language_variant()
Django 5.0.8 fixes the following CVEs:
* CVE-2024-41989: Memory exhaustion in django.utils.numberformat.floatformat()
* CVE-2024-41990: Potential denial-of-service vulnerability in django.utils.html.urlize()
* CVE-2024-41991: Potential denial-of-service vulnerability in django.utils.html.urlize() and AdminURLFieldWidget
* CVE-2024-42005: Potential SQL injection in QuerySet.values() and values_list()
Further release Notes: https://docs.djangoproject.com/en/5.0/releases/
Signed-off-by: Marcus Hoffmann <buildroot@bubu1.eu>
Signed-off-by: Thomas Petazzoni <thomas.petazzoni@bootlin.com>
(cherry picked from commit f777ce1fd6)
Signed-off-by: Peter Korsgaard <peter@korsgaard.com>
Commit 9696d27756 "package/gpsd: condition python stuff to the proper
kconfig option" changed the condition in which the gpsd python scripts
are installed. After that change, the "gpsfake" command (which is a
python script) is no longer found and the runtime test is failing.
This commit fixes the issue by reflecting the change in the runtime
test Buildroot configuration.
Signed-off-by: Julien Olivain <ju.o@free.fr>
Signed-off-by: Thomas Petazzoni <thomas.petazzoni@bootlin.com>
(cherry picked from commit b6f4d79df2)
Signed-off-by: Peter Korsgaard <peter@korsgaard.com>
This didn't work out as planned, neither the restriction of muting
unregistered users, nor the exception for matrix users worked as planned.
The channel mode has been reverted to +R (meaning only registered users
are allowed to join) and an exception for *that* has been introduced for
matrix users via +e. The channel modes are documented in [1].
[1] https://www.oftc.net/ChannelModes/
This reverts commit d1e6d7845b.
Signed-off-by: Marcus Hoffmann <buildroot@bubu1.eu>
Signed-off-by: Thomas Petazzoni <thomas.petazzoni@bootlin.com>
(cherry picked from commit bede54c774)
Signed-off-by: Peter Korsgaard <peter@korsgaard.com>
Building with GCC 14 fails at the configure step with:
./configure: error: libatomic_ops library was not found.
The error is not caused by a missing library, but by an unrelated
"incompatible pointer type" error in the test program:
...
checking for atomic_ops library
objs/autotest.c: In function 'main':
objs/autotest.c:9:48: error: passing argument 1 of 'AO_compare_and_swap' from incompatible pointer type [-Wincompatible-pointer-types]
This used to be a warning, but it is an error since GCC 14.[1]
Fix this by patching the test program in order to use the correct
pointer types.
Fixes: http://autobuild.buildroot.net/results/a3d/a3d8c6fd631b31e272e4d8cc6c3318f2e4151882
[1] https://gcc.gnu.org/gcc-14/porting_to.html#incompatible-pointer-types
Signed-off-by: Edgar Bonet <bonet@grenoble.cnrs.fr>
Signed-off-by: Arnout Vandecappelle <arnout@mind.be>
(cherry picked from commit 7d249dab51)
Signed-off-by: Peter Korsgaard <peter@korsgaard.com>
The mysql virtual package was removed in commit 8708f3a23a
"package/mysql: drop virtual package".
The mariadb runtime test was authored before this mysql virtual
package removal, but was merged after it, in commit 5356754d1e
"support/testing: add mariadb runtime test". Due to this, this test
always failed with the error:
Makefile.legacy:9: *** "You have legacy configuration in your .config! Please check your configuration.". Stop.
This commit fixes the issue by removing the legacy
BR2_PACKAGE_MYSQL=y configuration directive.
Fixes:
https://gitlab.com/buildroot.org/buildroot/-/jobs/7540345406
Signed-off-by: Julien Olivain <ju.o@free.fr>
Signed-off-by: Peter Korsgaard <peter@korsgaard.com>
(cherry picked from commit 3da3361a1b)
Signed-off-by: Peter Korsgaard <peter@korsgaard.com>
Maeva told me personally she will no longer contribute to Buildroot
for the time being. This commit removes all the associated DEVELOPERS
entries.
Signed-off-by: Julien Olivain <ju.o@free.fr>
Signed-off-by: Thomas Petazzoni <thomas.petazzoni@bootlin.com>
(cherry picked from commit 92d652df48)
Signed-off-by: Peter Korsgaard <peter@korsgaard.com>
Currently, we have a Kconfig symbol to enable the python support in
gpsd, but the condition at configure time is based on whether the python
package is enabled. So, if a user does not enable python support in
gpsd, they still get it.
Switch to using the proper symbol.
Signed-off-by: Yann E. MORIN <yann.morin@orange.com>
Cc: Bernd Kuhls <bernd@kuhls.net>
Reviewed-by: Jan Havran <havran.jan@email.cz>
Signed-off-by: Thomas Petazzoni <thomas.petazzoni@bootlin.com>
(cherry picked from commit 9696d27756)
Signed-off-by: Peter Korsgaard <peter@korsgaard.com>
Pass USE_LIBDRM=OFF to the wpewebkit CMake configuration step when the
libdrm package has not been selected.
WPE WebKit can be built without libdrm support, and it will still work
with backends that use other platform-specific methods to handle
graphics buffers and/or presenting content onto an output. For example
this is the case with wpebackend-rdk configured to use rpi-userland,
which uses dispmanx to produce the output instead of DRM/KMS.
Signed-off-by: Adrian Perez de Castro <aperez@igalia.com>
Signed-off-by: Thomas Petazzoni <thomas.petazzoni@bootlin.com>
(cherry picked from commit 65f8174648)
Signed-off-by: Peter Korsgaard <peter@korsgaard.com>
mdio-tools depends on CONFIG_MDIO_DEVICE in order for mdiobus driver to
be built, but CONFIG_MDIO_DEVICE depends on CONFIG_NETDEVICES which we
are not enabling so on platforms without it enabled in kernel config
building mdio-tools will fail with:
ERROR: modpost: "mdio_find_bus" [output-1/build/mdio-tools-1.3.1/kernel/mdio-netlink.ko] undefined!
ERROR: modpost: "__mdiobus_c45_read" [output-1/build/mdio-tools-1.3.1/kernel/mdio-netlink.ko] undefined!
ERROR: modpost: "__mdiobus_read" [output-1/build/mdio-tools-1.3.1/kernel/mdio-netlink.ko] undefined!
ERROR: modpost: "__mdiobus_c45_write" [output-1/build/mdio-tools-1.3.1/kernel/mdio-netlink.ko] undefined!
ERROR: modpost: "__mdiobus_write" [output-1/build/mdio-tools-1.3.1/kernel/mdio-netlink.ko] undefined!
So enable CONFIG_NETDEVICES as well to make sure CONFIG_MDIO_DEVICE can be enabled.
Fixes: http://autobuild.buildroot.net/results/edf47df96cde6094c890c0b74034cced90335a39/
Signed-off-by: Robert Marko <robimarko@gmail.com>
Signed-off-by: Thomas Petazzoni <thomas.petazzoni@bootlin.com>
(cherry picked from commit b95fff0185)
Signed-off-by: Peter Korsgaard <peter@korsgaard.com>
On the architectures that supports libsanitizer (part of gcc), the
build is currently failing with BR2_TIME_BITS_64=y. This is because
some code in libsanitizer unsets _FILE_OFFSET_BITS, but building code
with _FILE_OFFSET_BITS unset, but _TIME_BITS set isn't legal.
To fix this, this commit backports two changes:
- One change to also unset _TIME_BITS in
sanitizer_platform_limits_posix.cpp. This change is upstream in
LLVM, and already part of GCC 14.x, so we only bringing it to GCC
12.x and GCC 13.x.
- A second change doing the same modification, but in
sanitizer_procmaps_solaris.cpp, which as crazy as it might sound,
also gets compiled on Linux platforms (but to basically an empty
file). This change has been submitted upstream to both LLVM and gcc.
Notes:
- the special PowerPC SPE version of GCC cannot be affected, as only
uClibc-ng is used for this architecture, and uClibc-ng doesn't use
_TIME_BITS=64 (but now default to 64-bit time_t on 32-bit
architectures, like musl does).
- the special ARC version doesn't need patching because libsanitizer
doesn't support the ARC architecture, so it doesn't get built
Fixes:
http://autobuild.buildroot.net/results/ff2dbfdabf0bb6a0d82ea8a80122ab97fd75bd3f/https://gitlab.com/buildroot.org/buildroot/-/issues/16
Signed-off-by: Thomas Petazzoni <thomas.petazzoni@bootlin.com>
(cherry picked from commit 81a4b6e7b8)
[Peter: drop 14.1.0 patch]
Signed-off-by: Peter Korsgaard <peter@korsgaard.com>
The kconfig infra defines a 'PKG_KCONFIG_MAKE' var that wraps all the
standard kconfig options. Switch to this so we aren't duplicating the
logic.
Signed-off-by: Brandon Maier <brandon.maier@collins.com>
Signed-off-by: Thomas Petazzoni <thomas.petazzoni@bootlin.com>
(cherry picked from commit 009d31b438)
Signed-off-by: Peter Korsgaard <peter@korsgaard.com>
The 'linux-diff-config' target fails with the below error when
PER_PACKAGE_DIRECTORIES is enabled and the 'host-finalize' target hasn't
run yet.
scripts/Kconfig.include:39: C compiler '.../buildroot/output/host/bin/arm-buildroot-linux-gnueabihf-gcc' not found
The 'PPD' variable isn't defined for this target, so 'BR_PATH' falls
back to the final host directory.
Signed-off-by: Brandon Maier <brandon.maier@collins.com>
Signed-off-by: Thomas Petazzoni <thomas.petazzoni@bootlin.com>
(cherry picked from commit 641084bfb3)
Signed-off-by: Peter Korsgaard <peter@korsgaard.com>
The 'linux-savedefconfig' target fails with the below error when
PER_PACKAGE_DIRECTORIES is enabled and the 'host-finalize' target hasn't
run yet.
scripts/Kconfig.include:39: C compiler '.../buildroot/output/host/bin/arm-buildroot-linux-gnueabihf-gcc' not found
The 'PPD' variable isn't defined for this target, so 'BR_PATH' falls
back to the final host directory.
Reported-by: Nathaniel Roach <nroach44@gmail.com>
Signed-off-by: Brandon Maier <brandon.maier@collins.com>
Signed-off-by: Thomas Petazzoni <thomas.petazzoni@bootlin.com>
(cherry picked from commit de11afaa34)
Signed-off-by: Peter Korsgaard <peter@korsgaard.com>
Runtime tests running on test runners are subject to a high
variability in term of performance and timing. Most or the runtime
test commands are executed with a timeout, in pexpect.
Slow or very loaded test runners can use the timeout_multiplier to
globally increase those timeouts.
Some runtime test commands sometimes needs to poll or query a state,
rather than having purely sequential actions. It is sometimes hard to
know, from the test writer point of view, the maximum timeout to set, or
if a retry logic is needed.
In order to help debugging runtime tests failing due very slow
execution, this commit adds extra information on the host test runner
about its load in the run log. Relevant information are: number of
cpus, the load average at the moment the emulator is started and the
current timeout_multiplier.
Note: this change was discussed in:
https://lists.buildroot.org/pipermail/buildroot/2024-July/759119.html
Signed-off-by: Julien Olivain <ju.o@free.fr>
Signed-off-by: Thomas Petazzoni <thomas.petazzoni@bootlin.com>
(cherry picked from commit 7a6edbc7b9)
Signed-off-by: Peter Korsgaard <peter@korsgaard.com>
The libpwquality package provides the pam_pwquality PAM module - the
replacement for pam_cracklib that was dropped from linux-pam back in
version 1.5.0. However, it currently installs it to the wrong place,
so passwd and friends fail to find it. This commit sets the security
directory path to /lib/security to match the corresponding setting in
linux-pam.mk.
Note that libpwquality has *always* installed pam_pwquality in the wrong
place, since version 1.3.0 was added to buildroot in 2017 in commit
462040443c. However, back then, linux-pam
version 1.3.0 still provided pam_cracklib for advanced password checking.
Linux-pam deprecated pam_cracklib in 1.4.0 but still built it for us when
linux-pam.mk set --enable-cracklib. Linux-PAM deleted pam_cracklib
altogether in 1.5.0, so it was not until our update to linux-pam-1.5.1
in commit 276f1e0a89 that pam_cracklib
became unavailable. After that point, pam_pwquality was the only
alternative for PAM-based password checking.
Signed-off-by: Danomi Manchego <danomimanchego123@gmail.com>
Signed-off-by: Thomas Petazzoni <thomas.petazzoni@bootlin.com>
(cherry picked from commit 541eb8bf7d)
Signed-off-by: Peter Korsgaard <peter@korsgaard.com>
This commit allows the package patches to be applied with fuzz factor 0.
The fuzz factor specifies how many lines of the patch can be inexactly
matched, so the value 0 requires all lines to be exactly matched.
Signed-off-by: Dario Binacchi <dario.binacchi@amarulasolutions.com>
Signed-off-by: Arnout Vandecappelle <arnout@mind.be>
(cherry picked from commit f5226cd6b7)
Signed-off-by: Peter Korsgaard <peter@korsgaard.com>
When using BR2_STATIC_LIBS=y, tinysshd's build was successful, but the
binary didn't work on the final target: this is because a dynamically
linked ELF was produced, on a target having no dynamic loader at all.
Using $(TARGET_CONFIGURE_OPTS) propagates all the options and not only
"CC", resulting in a correct static binary able to run on the target.
Without the patch:
> tinysshd: ELF 32-bit LSB executable, ARM, EABI5 version 1 (SYSV),
> dynamically linked, interpreter /lib/ld-musl-armhf.so.1, stripped
With the patch:
> tinysshd: ELF 32-bit LSB executable, ARM, EABI5 version 1 (SYSV),
> statically linked, stripped
Fixes: a7b3de8a3b
Signed-off-by: Martin Wetterwald <martin@wetterwald.eu>
Signed-off-by: Thomas Petazzoni <thomas.petazzoni@bootlin.com>
(cherry picked from commit 90e22ff48b)
Signed-off-by: Peter Korsgaard <peter@korsgaard.com>
This update addresses the issue of uClibc support by skipping ZFS tests
that require SEEK_DATA support.
This is a work-in-progress patch while we wait for an upstream fix.
Current upstream efforts can be followed here:
https://github.com/openzfs/zfs/pull/16169
Context:
- OpenZFS includes a test for a bug that occurs when copying a large
number of PUNCHED files.
- OpenZFS has backported this test to v2.2.x.
- uClibc does not support SEEK_DATA and SEEK_HOLE.
- The ZFS test `cp_stress` can not be compiled using uClibc.
This commit fix:
- https://gitlab.com/buildroot.org/buildroot/-/jobs/7391793226
Signed-off-by: José Luis Salvador Rufo <salvador.joseluis@gmail.com>
Signed-off-by: Thomas Petazzoni <thomas.petazzoni@bootlin.com>
(cherry picked from commit f17fa2c905)
Signed-off-by: Peter Korsgaard <peter@korsgaard.com>
Enable DES in openssl to avoid the following build failure raised since
commit a83d41867c:
crypto/apr_crypto_openssl.c: In function 'crypto_cipher_mechanism':
crypto/apr_crypto_openssl.c:385:27: error: implicit declaration of function 'EVP_des_ede3_cbc'; did you mean 'NID_des_ede3_cbc'? [-Wimplicit-function-declaration]
385 | key->cipher = EVP_des_ede3_cbc();
| ^~~~~~~~~~~~~~~~
| NID_des_ede3_cbc
Fixes: a83d41867c
- http://autobuild.buildroot.org/results/4b1088a705f8564f85e629316f5cfc92953f0047
Signed-off-by: Fabrice Fontaine <fontaine.fabrice@gmail.com>
Signed-off-by: Arnout Vandecappelle <arnout@mind.be>
(cherry picked from commit 8bb67c230b)
Signed-off-by: Peter Korsgaard <peter@korsgaard.com>
Change the name from "Micro Python" (two words) to "MicroPython"
(camelcase), to match the official website and documentation.
Signed-off-by: J. Neuschäfer <j.neuschaefer@gmx.net>
Signed-off-by: Thomas Petazzoni <thomas.petazzoni@bootlin.com>
(cherry picked from commit 161c25aee1)
Signed-off-by: Peter Korsgaard <peter@korsgaard.com>
Fix the following build failure with host gcc >= 14 which enables
-Werror=implicit-function-declaration
(https://gcc.gnu.org/gcc-14/porting_to.html):
configure:9998: checking build system compiler /usr/bin/gcc
configure:10011: /usr/bin/gcc conftest.c
conftest.c: In function 'main':
conftest.c:4:3: error: implicit declaration of function 'exit' [-Wimplicit-function-declaration]
4 | exit(0);
| ^~~~
conftest.c:1:1: note: include '<stdlib.h>' or provide a declaration of 'exit'
+++ |+#include <stdlib.h>
1 | int
conftest.c:4:3: warning: incompatible implicit declaration of built-in function 'exit' [-Wbuiltin-declaration-mismatch]
4 | exit(0);
| ^~~~
conftest.c:4:3: note: include '<stdlib.h>' or provide a declaration of 'exit'
configure:10014: $? = 1
configure:10021: result: no
configure:10026: error: Specified CC_FOR_BUILD doesn't seem to work
Fixes:
- http://autobuild.buildroot.org/results/3ab381f06d5dc030039b6f6f8d19feb55cf3367d
Signed-off-by: Fabrice Fontaine <fontaine.fabrice@gmail.com>
Signed-off-by: Thomas Petazzoni <thomas.petazzoni@bootlin.com>
(cherry picked from commit 3bb426628c)
Signed-off-by: Peter Korsgaard <peter@korsgaard.com>
When the default (newest) kernel headers series changes the build can
break. Example error message:
Incorrect selection of kernel headers: expected 6.8.x, got 6.5.x
In the above case the defconfig used:
BR2_LINUX_KERNEL_CUSTOM_VERSION=y
BR2_LINUX_KERNEL_CUSTOM_VERSION_VALUE="6.5.9"
The kernel headers were not specified, so the build defaulted to using
the kernel sources as header source and the default (newest) header
series. From .config:
BR2_KERNEL_HEADERS_AS_KERNEL=y
BR2_PACKAGE_HOST_LINUX_HEADERS_CUSTOM_6_8=y
Signed-off-by: Gero Schwäricke <gero.schwaericke@posteo.de>
Signed-off-by: Arnout Vandecappelle <arnout@mind.be>
(cherry picked from commit eb519ad7cc)
Signed-off-by: Peter Korsgaard <peter@korsgaard.com>
*ucontext functions are only implemented for a subset of
uClibc supported architectures. To allow the external library
libucontext to be used this small patch is required.
Tested for riscv64.
Signed-off-by: Waldemar Brodkorb <wbx@openadk.org>
Signed-off-by: Thomas Petazzoni <thomas.petazzoni@bootlin.com>
(cherry picked from commit f761a8c451)
Signed-off-by: Peter Korsgaard <peter@korsgaard.com>
Release Notes: https://nodejs.org/en/blog/release/v20.15.1
Fixes the following CVE's:
CVE-2024-36138 - Bypass incomplete fix of CVE-2024-27980 (High)
CVE-2024-22020 - Bypass network import restriction via data URL (Medium)
CVE-2024-22018 - fs.lstat bypasses permission model (Low)
CVE-2024-36137 - fs.fchown/fchmod bypasses permission model (Low)
CVE-2024-37372 - Permission model improperly processes UNC paths (Low)
Also these additional CVE's were fixed in the v20.12.1 and v20.12.2 releases [1][2]:
CVE-2024-27983 - Assertion failed in node::http2::Http2Session::~Http2Session() leads to HTTP/2 server crash- (High)
CVE-2024-27982 - HTTP Request Smuggling via Content Length Obfuscation - (Medium)
CVE-2024-27980 - Command injection via args parameter of child_process.spawn without shell option enabled on Windows
NodeJS tests are passing:
$ ./support/testing/run-tests -o ./outputs/ -k tests.package.test_nodejs -d dl
12:02:58 TestNodeJSModuleHostSrc Starting
12:02:58 TestNodeJSModuleHostSrc Building
13:17:15 TestNodeJSModuleHostSrc Building done
13:17:23 TestNodeJSModuleHostSrc Cleaning up
.13:17:23 TestNodeJSModuleHostBin Starting
13:17:23 TestNodeJSModuleHostBin Building
14:06:15 TestNodeJSModuleHostBin Building done
14:06:20 TestNodeJSModuleHostBin Cleaning up
.14:06:20 TestNodeJSBasic Starting
14:06:20 TestNodeJSBasic Building
14:55:40 TestNodeJSBasic Building done
14:55:45 TestNodeJSBasic Cleaning up
LICENSE hash changed due to changes in vendored components:
* copyright year update and adding spdx identifier [1]
[1] https://nodejs.org/en/blog/release/v20.12.1
[2] https://nodejs.org/en/blog/release/v20.12.2
[3] https://github.com/nodejs/node/commit/d5a316f5ea3fade3140c2ae35c144b500fb5d758
Signed-off-by: Marcus Hoffmann <buildroot@bubu1.eu>
Signed-off-by: Thomas Petazzoni <thomas.petazzoni@bootlin.com>
(cherry picked from commit bffb6a2339)
Signed-off-by: Peter Korsgaard <peter@korsgaard.com>
- fix alphabetical ordering
- put one module per line
- add comment explaining why options are enabled
Signed-off-by: Michael Nosthoff <buildroot@heine.tech>
Signed-off-by: Arnout Vandecappelle <arnout@mind.be>
(cherry picked from commit 5c20804afa)
Signed-off-by: Peter Korsgaard <peter@korsgaard.com>
Lots of people are using broken text editors that 1. do not naturally
terminate text files with a final \n as is customary in UNIX text files,
and 2. do not respect our .editorconfig settings, which explicitly
require adding that final newline. See this nice summary of what a text
file is (with references to applicable standards):
https://stackoverflow.com/questions/12916352/shell-script-read-missing-last-line/12916758#12916758
So, it is not surprising that read does not read the last "line" of a
file, when said "line" does not end with a newline, because it is thus
not really a line.
Even though we do mandate actual text files, let's be a little bit lax
in this respect, because people may write packages, and their hash
files, in a br2-external tree, and they may not have our .editorconfig
in the directory heierarchy (e.g. if buildroot is a submodule of their
br2-external tree, or whatever).
mapfile does not suffer from this limitation, though, and correctly
reads all lines from a file, even the final line-that-is-not-a-line.
mapfile was introduced in bash 4.0, released on 2009-01-20, more than
15 years ago. Debian squeeze, released in 2011 already had bash 4.1.
Those are really ancient. So, it means we can indeed expect bash
version 4.0 or later; which means mapfile is available.
"It should be fine!"
Fixes: #15976
Reported-by: masonwardle@gmail.com
Signed-off-by: Yann E. MORIN <yann.morin.1998@free.fr>
Signed-off-by: Arnout Vandecappelle <arnout@mind.be>
(cherry picked from commit ac2e6b3927)
Signed-off-by: Peter Korsgaard <peter@korsgaard.com>
According to https://spdx.org/licenses/, the correct license code for
the "Clarified Artistic License" is ClArtistic.
The only other package in Buildroot containing code under this license
is google-breakpad, and it is already using the ClArtistic SPDX code.
Signed-off-by: Thomas Petazzoni <thomas.petazzoni@bootlin.com>
Signed-off-by: Arnout Vandecappelle <arnout@mind.be>
(cherry picked from commit 2ca698051c)
Signed-off-by: Peter Korsgaard <peter@korsgaard.com>
`b4` is a commandline tool to make patch-based development easier[1]. It
is primarily used for Linux kernel development, but can be configured to
support any project that has a public-inbox endpoint. Buildroot has a
public-inbox mirror at "https://lore.kernel.org/buildroot/".
We configure some basic settings that tell `b4` where to send patches
and how to use get-developers.
[1] https://b4.docs.kernel.org/en/latest/
Signed-off-by: Brandon Maier <brandon.maier@collins.com>
Signed-off-by: Arnout Vandecappelle <arnout@mind.be>
(cherry picked from commit 322213e131)
Signed-off-by: Peter Korsgaard <peter@korsgaard.com>
Some files were not shown because too many files have changed in this diff
Show More
Reference in New Issue
Block a user
Blocking a user prevents them from interacting with repositories, such as opening or commenting on pull requests or issues. Learn more about blocking a user.