The weston runtime test is unreliable, depending on the execution speed
of its runner. Example of failure is [1], and success is [2]. This
commit improves the test in several ways, to make it more robust to
execution speed variations:
- The command started in background (weston, weston-simple-egl) are
now started in a subshell. This suppresses the job control messages
when they are stopped. Those messages could interfere with the parsing
of the output;
- Wait time are moved outside the emulator;
- The kernel argument vt.global_cursor_default=0 is added, to make sure
cursors are globally disabled, since the test use vkms display CRCs;
- The memory of the emulator is increased to 512M. This test uses cpio
initramfs, and the filesystem size increased;
- The vkms driver emulates a "vsync" event, but can generate a warning
when the system is too slow. This warning is printed on the console by
the klogd daemon in its default configuration. This commit adds the
overlay file /etc/default/klogd to limit only kernel emergency
messages to be printed on the console. This change fixes the failure
seen in [1] ;
- Some sleep time values were adjusted to run on a "performant" idle
host. Those values are not suitable in all situations. In the
meantime a generic retry mechanism is added in the test infra, this
commit adds a retry logic inspired from the test_flutter runtime
test.
Fixes: [1]
[1] https://gitlab.com/buildroot.org/buildroot/-/jobs/8562483474
[2] https://gitlab.com/buildroot.org/buildroot/-/jobs/8435236652
Signed-off-by: Julien Olivain <ju.o@free.fr>
Signed-off-by: Peter Korsgaard <peter@korsgaard.com>
(cherry picked from commit 6561a5d773)
Signed-off-by: Peter Korsgaard <peter@korsgaard.com>
The lmbench package (largely unmaintained upstream, last release in
2006) uses a home-grown build system. The scripts/build script sets
LDLIBS to -lm and Buildroot's makefile changes that to:
LDLIBS+=-lm
Except that when Buildroot passes LDLIBS="`$(PKG_CONFIG_HOST_BINARY)
--libs libtirpc`", the LDLIBS variable ends up being equal to:
-ltirpc-lm
Yes, without any space between -ltirpc and -lm.
Due to this, the checks in scripts/build that use ${LDLIBS} all fail,
and in particular the test that checks when socklen_t is a known type
fails, causing lmbench to provide its own definition, which clashes
with the C library headers definition, and therefore causing build
failures such as:
bench.h:81:13: error: conflicting types for 'socklen_t'; have 'int'
This commit fixes that by adjusting scripts/build using a patch to
properly allow passing additional ${LDLIBS} value, with the needed
space to separate the value from -lm.
Fixes:
http://autobuild.buildroot.net/results/f1715de95b46a1d08143e529bd4574bc7dbcfb3e/
We have been unable to determine exactly when this issue was
introduced. The first build failure we could find is the one
referenced above, which dates back from Aug 19, 2024. Since this date,
lmbench has been consistently failing on a very regular
basis. However, prior to Aug 19, 2024, the previous failure was from
December 2022, and was unrelated. It is unclear what changed in Aug
2024 to cause this issue to surface. The one thing that changed right
before commit ce3dedc2 (first failing commit) are changes to
genrandconfig, which ensures all autobuilders now generated fully
random configurations instead of configurations based on a
well-defined list of arch/toolchain configurations. But even with
this, this lmbench issue should have appeared earlier, and we have
been unable to find a scientific explanation.
Signed-off-by: Thomas Petazzoni <thomas.petazzoni@bootlin.com>
Signed-off-by: Peter Korsgaard <peter@korsgaard.com>
(cherry picked from commit 80f25d4706)
Signed-off-by: Peter Korsgaard <peter@korsgaard.com>
The android-tools code base uses the __b64_pton() function, which
isn't provided by all C libraries. So the Debian patch
debian/patches/add_adbd.patch adds an implementation of b64_pton(),
but doesn't actually use it, nor defines a prototype for it. Our
existing patch 0003-Fix-build-issue-with-uclibc.patch switches the
code to use the b64_pton() function... but still without providing a
prototype, causing the following build failures with GCC >= 14.x:
adb_auth_client.c:75:15: error: implicit declaration of function 'b64_pton'
To fix this, we rework 0003-Fix-build-issue-with-uclibc.patch into a
patch that:
(1) Renames b64_pton() to adb_b64_pton() to make sure it won't clash
with implementations provided by some C libraries, and adjusts
the call sites accordingly.
(2) Adds a prototype definition of adb_b64_pton() in places where
this function is used.
Fixes:
http://autobuild.buildroot.net/results/b25b25337c7ad89c33f8bd20b646850bd993ec53ae9/
Even though GCC 14.x support was merged in Buildroot in May 2024, this
particular b64_pton() only started appearing on July 15 2024, with the
first occurence being:
http://autobuild.buildroot.net/results/1cbe87bbe3c56f28444b3aaba1ba1d05f947d36e/
Indeed, it's not before July 15 2024 that we merged commit
d201f2f5cd ("package/android-tools: add
patches to fix build with GCC 14.x"), which fixed other GCC 14.x
issues, which were hiding this b64_pton() problem.
Signed-off-by: Thomas Petazzoni <thomas.petazzoni@bootlin.com>
Signed-off-by: Arnout Vandecappelle <arnout@mind.be>
(cherry picked from commit 1eec67d164)
Signed-off-by: Peter Korsgaard <peter@korsgaard.com>
The kernel headers on mips64 and powerpc64 were historically "broken",
defining u64 as an "unsigned long" instead of "unsigned long
long". This has been fixed in the upstream Linux kernel by introducing
the __SANE_USERSPACE_TYPES__ definition.
Our commit a2e178d6b4 ("android-tools:
disable on some architecture with old kernel headers") already
disabled building fastboot on powerpc64 and mips64 systems that have
too old kernel headers. However, it turns out that even with the new
kernel headers, there are build issues because
__SANE_USERSPACE_TYPES__ isn't defined everywhere it should be in the
android-tools code base. The Debian patche
debian/patches/ppc64el-ftbfs.patch adds some definitions, but it's
missing one file, and in another the definition comes too late.
This commit adds an extra patch that fixes this up, and makes fastboot
build properly on mips64 and powerpc64.
Fixes:
http://autobuild.buildroot.net/results/8528ff876e695f79bdfe64f5330d9d51eeef66cb/ (powerpc64)
http://autobuild.buildroot.net/results/36ac6af73b618c28d1636093da333f7ebd9d6cfe/ (mips64)
This issue has been occurring as far as Feb 2021, with the first
occurence apparently being:
http://autobuild.buildroot.net/results/d9521b4bfeafb1140c21745dbfe28d476a9b71ec/
Signed-off-by: Thomas Petazzoni <thomas.petazzoni@bootlin.com>
Signed-off-by: Arnout Vandecappelle <arnout@mind.be>
(cherry picked from commit ee65a2119a)
Signed-off-by: Peter Korsgaard <peter@korsgaard.com>
This will make it easier to modify the patch series moving forward. No
functional changes.
On one patch, we added the SoB from Giulio, which was missing. Giulio
was the original contributor of the patch, and nobody touched it since
it was introduced.
Signed-off-by: Thomas Petazzoni <thomas.petazzoni@bootlin.com>
Signed-off-by: Arnout Vandecappelle <arnout@mind.be>
(cherry picked from commit 3ee745782a)
Signed-off-by: Peter Korsgaard <peter@korsgaard.com>
losetup -f returns the next free loop device, which may not be
/dev/loop0. If you blindly follow the readmy you may end up destroying
an existing device.
Make it more robust with a variable to store the loop device.
Signed-off-by: Cherniaev Andrei <dungeonlords789@naver.com>
[Arnout: keep the actual losetup atomic]
Signed-off-by: Arnout Vandecappelle <arnout@mind.be>
(cherry picked from commit 7dd56b6cd9)
Signed-off-by: Peter Korsgaard <peter@korsgaard.com>
nfs-utils configure script uses "systemd-escape" to determine the
rpc_pipefs mount point unit name in the non-default case.
If the host build system has no systemd this will silently result in an
empty name, causing rpc_pipefs.target to incorrectly depend on ".mount".
Fix that by depending on host-systemd for build.
Signed-off-by: Anssi Hannula <anssi.hannula@bitwise.fi>
Acked-by: Petr Vorel <petr.vorel@gmail.com>
Signed-off-by: Arnout Vandecappelle <arnout@mind.be>
(cherry picked from commit 4c9b13b8dd)
Signed-off-by: Peter Korsgaard <peter@korsgaard.com>
As it happens, I am unable to keep maintaining those entries, and it is
misleading to others about whether they should Cc me on their changes.
Signed-off-by: Yann E. MORIN <yann.morin.1998@free.fr>
Signed-off-by: Julien Olivain <ju.o@free.fr>
(cherry picked from commit 773a89d414)
Signed-off-by: Peter Korsgaard <peter@korsgaard.com>
When halting the boot process in u-boot, the 'usb start' command does not
automatically run. Since the SD card is connected over a USB to SD card
bridge on the kd240 and kr260 boards, the readme.txt instructions should
document that the 'usb start' command needs to be manually enterred when
following the reflashing instructions. Otherwise, the command to read the
boot.bin and u-boot.itb files from the SD card will fail.
Signed-off-by: Neal Frager <neal.frager@amd.com>
Signed-off-by: Julien Olivain <ju.o@free.fr>
(cherry picked from commit e02e59d124)
Signed-off-by: Peter Korsgaard <peter@korsgaard.com>
The mosquitto runtime test can randomly fail on slow
runners, see [1].
This commit improves this test in the following ways:
- the mosquitto_sub subscriber process is now started in a subshell
to suppress the job control messages (to prevent any spurious
messages when the job stops),
- the standard error is redirected to /dev/null, to prevent the
printing of any messages,
- the mosquitto_pub publisher process is started later, by increasing
the sleep time,
- finally, a new sleep time is introduced between the mosquitto_pub
publisher process and the check of the mosquitto_sub subscriber, to
make sure it will have time to write its output and exit.
Fixes: [1]
[1] https://gitlab.com/buildroot.org/buildroot/-/jobs/8453386454
Signed-off-by: Julien Olivain <ju.o@free.fr>
Signed-off-by: Thomas Petazzoni <thomas.petazzoni@bootlin.com>
(cherry picked from commit 07a444d088)
Signed-off-by: Peter Korsgaard <peter@korsgaard.com>
Host bmap-tools runs using host-python3, but did not select it,
leading to the confusing situation that BR2_PACKAGE_HOST_PYTHON3=n
even though it was built and working.
Signed-off-by: Fiona Klute (WIWA) <fiona.klute@gmx.de>
Signed-off-by: Peter Korsgaard <peter@korsgaard.com>
(cherry picked from commit dbb019db73)
Signed-off-by: Peter Korsgaard <peter@korsgaard.com>
Asaf has privately requested to be removed from the DEVELOPERS file as
he will no longer be contributing to Buildroot in the forseeable
future.
Signed-off-by: Thomas Petazzoni <thomas.petazzoni@bootlin.com>
(cherry picked from commit 353a37b04d)
Signed-off-by: Peter Korsgaard <peter@korsgaard.com>
Due to a bug in the Config.in comment dependencies, the comment "***
picotool needs a toolchain w/ C++, threads, gcc >= 4.9 ***" is always
shown even if all features are enabled.
Fixes: d30c1e3c58 ("package/picotool: fix libusb dependencies")
Signed-off-by: Cherniaev Andrei <dungeonlords789@naver.com>
Signed-off-by: Thomas Petazzoni <thomas.petazzoni@bootlin.com>
(cherry picked from commit d2f5678f42)
Signed-off-by: Peter Korsgaard <peter@korsgaard.com>
mender_x86_64_efi_defconfig started failing to build since 2024.08 in
our Gitlab-ci since the board/mender/x86_64/post-image-efi.sh is
calling support/scripts/genimage.sh with the host default shell.
There is no problem if the default shell is bash but our docker
image uses dash as default shell. Since support/scripts/genimage.sh
is actually a bash script it's not going to work if bashisms are used:
support/scripts/genimage.sh: 57: Syntax error: redirection unexpected
Indeed bashisms have been added recently in
support/scripts/genimage.sh by the commit introducing bmap image
support [1].
Remove "sh" before support/scripts/genimage.sh and rely on
"/usr/bin/env bash" to find the bash interpreter.
Fixes:
https://gitlab.com/buildroot.org/buildroot/-/jobs/8233226891
[1] 6889056f1e
Signed-off-by: Romain Naour <romain.naour@smile.fr>
Signed-off-by: Julien Olivain <ju.o@free.fr>
(cherry picked from commit c146555faa)
Signed-off-by: Peter Korsgaard <peter@korsgaard.com>
The rootfs partition is the first partition, not the second one: the
Grub configuration file already contains root=/dev/sda1 by default,
and it should be changed to root=/dev/vda1 if Qemu emulation is used.
Signed-off-by: Cherniaev Andrei <dungeonlords789@naver.com>
Signed-off-by: Thomas Petazzoni <thomas.petazzoni@bootlin.com>
(cherry picked from commit 9e3d572ff5)
Signed-off-by: Peter Korsgaard <peter@korsgaard.com>
checksec-2.7.1.tar.gz archive was replaced or regenerated by upstream
sometime between the 22 September 2024 [1] and the 29 September 2024
[2].
diffoscope report no changes in extracted files exept a different
top directory name (checksec.sh-2.7.1/checksec-2.7.1):
--- checksec-2.7.1.tar.gz a0d7a444d4603fb3d62fa25ef678e544ef39fa7b3c9bd5d22f1a8c526152cdde
+++ checksec-2.7.1.tar.gz eba0616f4033385d6093608a2a2aad3c2debb847d6778c87346f89c80946684f
Files identical despite different names
--- checksec-2.7.1/ChangeLog
+++ checksec.sh-2.7.1/ChangeLog
Use the git hash of the 2.7.1 release to use a different archive name
than the checksec-2.7.1.tar.gz archive previously released.
[1] https://gitlab.com/buildroot.org/buildroot/-/jobs/7888799855
[2] https://gitlab.com/buildroot.org/buildroot/-/jobs/7948006849
Fixes:
https://gitlab.com/buildroot.org/buildroot/-/jobs/7948006849
Signed-off-by: Romain Naour <romain.naour@smile.fr>
Signed-off-by: Thomas Petazzoni <thomas.petazzoni@bootlin.com>
(cherry picked from commit e82217622e)
Signed-off-by: Peter Korsgaard <peter@korsgaard.com>
The systemd service deployed to the target is derived from an example
hardcoded for the /usr/local/sbin/ path, but we install sshguard at
/usr/sbin/. Thus, by default we get this error message:
$ journalctl -b -u sshguard.service -f
systemd[1]: Started SSHGuard - blocks brute-force login attempts.
(sshguard)[612]: sshguard.service: Unable to locate executable '/usr/local/sbin/sshguard': No such file or directory
(sshguard)[612]: sshguard.service: Failed at step EXEC spawning /usr/local/sbin/sshguard: No such file or directory
systemd[1]: sshguard.service: Main process exited, code=exited, status=203/EXEC
systemd[1]: sshguard.service: Failed with result 'exit-code'.
systemd[1]: sshguard.service: Scheduled restart job, restart counter is at 5.
systemd[1]: sshguard.service: Start request repeated too quickly.
systemd[1]: sshguard.service: Failed with result 'exit-code'.
systemd[1]: Failed to start SSHGuard - blocks brute-force login attempts.
Fix up the path in the service after the $(INSTALL) command has run.
Signed-off-by: Vladimir Oltean <olteanv@gmail.com>
Signed-off-by: Thomas Petazzoni <thomas.petazzoni@bootlin.com>
(cherry picked from commit 750d0e377d)
Signed-off-by: Peter Korsgaard <peter@korsgaard.com>
This patch fixes a regression [1] introduced in ntpd 4.2.8p18 [2].
ntpd[200]: Listen normally on 3 lo [::1]:123
ntpd[200]: bind(20) AF_INET6 [fe80::bf3d:254d:dee0:d345%3]:123 flags 0x811 failed: Cannot assign requested address
ntpd[200]: unable to create socket on enp0s3 (4) for [fe80::bf3d:254d:dee0:d345%3]:123
ntpd[192]: daemon control: got EOF
ntpd[192]: daemon child died with signal 11
systemd[1]: ntpd.service: Control process exited, code=exited, status=70/SOFTWARE
systemd[1]: ntpd.service: Failed with result 'exit-code'.
systemd[1]: Failed to start Network Time Service.
If the IPv6 link-local interface was not ready for binding on the first
attempt, ntpd would segfault in update_interfaces(). The segfault would
only occur when ntpd was started as part of the boot sequence. Most
- but not all - boots were affected. Evidently it could happen that the
timing of ntpd's start up was delayed enough that the IPv6 link-local
interface was ready for the bind() call when it was first issued by
open_socket() via create_interface().
[1]: https://bugs.ntp.org/show_bug.cgi?id=3928
[2]: https://bugs.ntp.org/show_bug.cgi?id=3913
Signed-off-by: TIAN Yuanhao <tianyuanhao3@163.com>
Cc: Bernd Kuhls <bernd.kuhls@t-online.de>
Signed-off-by: Thomas Petazzoni <thomas.petazzoni@bootlin.com>
(cherry picked from commit 489e38fd2c)
Signed-off-by: Peter Korsgaard <peter@korsgaard.com>
when pam_lastlog.so is not installed login issues an error
that it is not able to load it.
Hence only enable the entry when pam_lastlog.so is installed.
Fixes:
login[649]: PAM unable to dlopen(/lib/security/pam_lastlog.so): /lib/security/pam_lastlog.so: cannot open shared object file: No such file or directory
login[649]: PAM adding faulty module: /lib/security/pam_lastlog.so
Signed-off-by: Michael Nosthoff <buildroot@heine.tech>
Signed-off-by: Thomas Petazzoni <thomas.petazzoni@bootlin.com>
(cherry picked from commit ee5c08aa88)
Signed-off-by: Peter Korsgaard <peter@korsgaard.com>
Since commit
a39e0b95e1 ("package/qt6/qt6base: add
support for concurrent module"), we have an explicit option that
enables/disables concurrent support, so it no longer makes sense to
explicitly disable it unconditionally first.
Signed-off-by: Hannah Kiekens <hannah.kiekens@mind.be>
Signed-off-by: Thomas Petazzoni <thomas.petazzoni@bootlin.com>
(cherry picked from commit 2de79d7065)
Signed-off-by: Peter Korsgaard <peter@korsgaard.com>
The homepage has moved, the previous one links to the new URL.
Signed-off-by: Fiona Klute (WIWA) <fiona.klute@gmx.de>
[yann.morin.1998@free.fr: split into its own patch]
Signed-off-by: Yann E. MORIN <yann.morin.1998@free.fr>
Signed-off-by: Thomas Petazzoni <thomas.petazzoni@bootlin.com>
(cherry picked from commit 3ee7c891a0)
Signed-off-by: Peter Korsgaard <peter@korsgaard.com>
When compiling jailhouse with BR2_PACKAGE_JAILHOUSE_HELPER_SCRIPTS=y,
build is failing with error:
Traceback (most recent call last):
File "/buildroot/output/build/jailhouse-e57d1eff6d55aeed5f977fe4e2acfb6ccbdd7560/setup.py", line 18, in <module>
setup(name="pyjailhouse", version=version,
File "/buildroot/output/host/lib/python3.12/site-packages/setuptools/__init__.py", line 108, in setup
return distutils.core.setup(**attrs)
^^^^^^^^^^^^^^^^^^^^^^^^^^^^^
...
File "/buildroot/output/host/lib/python3.12/sysconfig.py", line 549, in _init_posix
_temp = __import__(name, globals(), locals(), ['build_time_vars'], 0)
^^^^^^^^^^^^^^^^^^^^^^^^^^^^^^^^^^^^^^^^^^^^^^^^^^^^^^^^^^^^^
ValueError: Empty module name
This is due to a missing dependency on the target python3 package.
Jailhouse Python scripts are using setuptools with host-python3 which
reads its sysconfig data from the target-python3. See:
https://gitlab.com/buildroot.org/buildroot/-/blob/2024.08.1/package/pkg-python.mk?ref_type=tags#L33
If the target python3 is not installed, this get expanded as an empty
string, leading to this "ValueError: Empty module name" error.
Pure Python packages which are using the python-package infrastructure
usually get this dependency automatically from:
https://gitlab.com/buildroot.org/buildroot/-/blob/2024.08.1/package/pkg-python.mk?ref_type=tags#L295
Here, the jailhouse package rather uses the generic-package
infrastructure, then installs the Python scripts (if enabled) with
dedicated macros. This is why the target python3 is needed.
This commit fixes the issue by adding this missing dependency.
Signed-off-by: Julien Olivain <ju.o@free.fr>
Signed-off-by: Thomas Petazzoni <thomas.petazzoni@bootlin.com>
(cherry picked from commit c808e271e3)
Signed-off-by: Peter Korsgaard <peter@korsgaard.com>
This is bugfix release of stable libmdbx branch.
The most significant fixes since v0.12.10 (the previous version pinned to
buildroot):
- Fixed the possibility of `SIGSEGV` inside the `coherence_check()` after
changing the geometry by another process with an increase in the upper
DB size above the previous in-process limit.
- Fixed cursor(s) handling opened in parent transactions and closed before
the completion of nested/child transactions. In such case, closed
cursors were "resurrected", which led to a leak of memory allocated for
such cursors.
- Fixed a possibility of `SIGSEGV` when enabling logging of the
`MDBX_LOG_TRACE` level in debug builds.
- Correction of the missing `TXN_END_EOTDONE` in the case the start of
a reading transaction fails. The mentioned bit-flag was missing in the
transaction destruction/shutdown path on error its launch. Because of
this, an attempt was made to destroy the cursors, which led to crash
debug builds, since the corresponding array is intentionally filled
with poison pointers.
- Modification of `mdbx_close_by()` to return an error when trying to
close the dbi descriptor of a table created and/or modified in a
still-running transaction. Such premature closure of the descriptor is
an incorrect use of the API and a violation of the contract/preconditions
formulated in the description of `mdbx_close_dbi()`.
However, instead of returning an error, an incorrect closure of the
descriptor was performed, which could lead to the creation of a table
with an empty name, leakage of database pages and/or corruption of a
b-tree structure (wrong reference to the root of a table).
The complete ChangeLog:
https://gitflic.ru/project/erthink/libmdbx/blob?file=ChangeLog.md
Signed-off-by: Леонид Юрьев (Leonid Yuriev) <leo@yuriev.ru>
Signed-off-by: Thomas Petazzoni <thomas.petazzoni@bootlin.com>
(cherry picked from commit 81e7806b93)
Signed-off-by: Peter Korsgaard <peter@korsgaard.com>
in e97fc89e7b a dependency on host-gcc >= 7 was added but
for the comment the condition was not correctly inverted.
Fixes: e97fc89e7b ("package/protobuf-c: bump to version 1.5.0")
Signed-off-by: Michael Nosthoff <buildroot@heine.tech>
Signed-off-by: Thomas Petazzoni <thomas.petazzoni@bootlin.com>
(cherry picked from commit 84ef9bede6)
Signed-off-by: Peter Korsgaard <peter@korsgaard.com>
When BR2_LINUX_KERNEL_IMAGE_TARGET_CUSTOM=y,
BR2_LINUX_KERNEL_IMAGE_TARGET_NAME is supposed to be non-empty. But in
the context of genraconfig, we don't know to what value
BR2_LINUX_KERNEL_IMAGE_TARGET_NAME can be set, so let's avoid cases
where BR2_LINUX_KERNEL_IMAGE_TARGET_CUSTOM=y. By dropping this option,
kconfig will revert back to the default image format for the selected
architecture.
Fixes:
http://autobuild.buildroot.net/results/1d104a051c83bb31e98565369a2ec7badfa21eca/
Signed-off-by: Thomas Petazzoni <thomas.petazzoni@bootlin.com>
(cherry picked from commit b07d21ab98)
Signed-off-by: Peter Korsgaard <peter@korsgaard.com>
Generating Bitcoins to an address can take longer than the current
timeout, on slow runners. This commit fixes this issue by increasing
the timeout on specific commands. This issue was also observed more
frequently on newer bitcoin-core version 28.0.
Fixes:
https://gitlab.com/buildroot.org/buildroot/-/jobs/7782083081
Signed-off-by: Julien Olivain <ju.o@free.fr>
Signed-off-by: Thomas Petazzoni <thomas.petazzoni@bootlin.com>
(cherry picked from commit 859c4ea5f7)
Signed-off-by: Peter Korsgaard <peter@korsgaard.com>
Since commit: https://git.postgresql.org/gitweb/?p=postgresql.git;a=commit;h=52afe563206e753f4c45c014fee2459ad0855826
postgrsql fails to build with toolchains without threads support:
misc.c: In function 'ecpg_gettext':
misc.c:541:51: error: 'PTHREAD_MUTEX_INITIALIZER' undeclared (first use in this function)
541 | static pthread_mutex_t binddomain_mutex = PTHREAD_MUTEX_INITIALIZER;
| ^~~~~~~~~~~~~~~~~~~~~~~~~
misc.c:541:51: note: each undeclared identifier is reported only once for each function it appears in
misc.c:552:24: warning: implicit declaration of function 'pthread_mutex_lock' [-Wimplicit-function-declaration]
552 | (void) pthread_mutex_lock(&binddomain_mutex);
| ^~~~~~~~~~~~~~~~~~
misc.c:569:24: warning: implicit declaration of function 'pthread_mutex_unlock' [-Wimplicit-function-declaration]
569 | (void) pthread_mutex_unlock(&binddomain_mutex);
| ^~~~~~~~~~~~~~~~~~~~
Option "--disable-thread-safety" will be dropped in PG 17, so
this patch is needed only for 16.x branch.
Fixes: 73dd1d6b96 ("package/postgresql: security bump version to 16.3")
Signed-off-by: Maxim Kochetkov <fido_max@inbox.ru>
Signed-off-by: Thomas Petazzoni <thomas.petazzoni@bootlin.com>
(cherry picked from commit 747a41c19c)
Signed-off-by: Peter Korsgaard <peter@korsgaard.com>
This fixes nethogs being built with the (mangled) buildroot version
name from the outer buildroot git repo.
Signed-off-by: Marcus Hoffmann <buildroot@bubu1.eu>
Signed-off-by: Thomas Petazzoni <thomas.petazzoni@bootlin.com>
(cherry picked from commit 3d28ee3318)
Signed-off-by: Peter Korsgaard <peter@korsgaard.com>
The package homepage http url redirects to https. This commit updates
this url to directly use https.
Signed-off-by: Julien Olivain <ju.o@free.fr>
Signed-off-by: Thomas Petazzoni <thomas.petazzoni@bootlin.com>
(cherry picked from commit 5440d6c446)
Signed-off-by: Peter Korsgaard <peter@korsgaard.com>
The package _SITE url only contains the latest version at a given point
in time. When a new version is published, it is replacing the old one.
This issue was not detected because the archive was downloaded from the
sources.buildroot.org backup mirror, when the primary source became
unavailable.
Since commit 559bb33ae "support/testing: do not use s.b.o" [1], the
runtime test infrastructure is disabling this backup mirror. This
makes the nmap runtime test failing [2], which is using liblinear as
a dependency.
The liblinear package author confirmed in a private email that all the
releases, including the latest version, are all kept in the "oldfiles"
directory.
This commit fixes this download issue by updating the _SITE url to that
location. While at it, this commit also change the url to use https
(since the http equivalent redirects to https).
Fixes:
- [2]
[1] https://gitlab.com/buildroot.org/buildroot/-/commit/559bb33ae71dd2358ca2314ccb24b56cc3809fc1
[2] https://gitlab.com/buildroot.org/buildroot/-/jobs/7948008007
Signed-off-by: Julien Olivain <ju.o@free.fr>
Signed-off-by: Thomas Petazzoni <thomas.petazzoni@bootlin.com>
(cherry picked from commit 8b18c67f26)
Signed-off-by: Peter Korsgaard <peter@korsgaard.com>
This fixes the following runtime error when importing PyQt5 in python:
from PyQt5.QtCore import *
ModuleNotFoundError: No module named 'PyQt5.sip'
The problem was likely triggered by the atomic upgrade from 5.7 to
5.15 in b36ce7e. This commit is part of the 2022-2024 LTS.
Signed-off-by: Ralf Dragon <hypnotoad@lindra.de>
Tested-by: Andreas Naumann <anaumann@ultratronik.de>
Signed-off-by: Julien Olivain <ju.o@free.fr>
(cherry picked from commit ba09a448f1)
[Peter: reword commit summary]
Signed-off-by: Peter Korsgaard <peter@korsgaard.com>
Version environment variable VERSION=$(VERSION) is set in the top level
Makefile of the sysvinit:
$(MAKE) VERSION=$(VERSION) -C src $@
Build command SYSVINIT_BUILD_CMDS doesn't use the top level Makefile, but
src/Makefile instead without setting the VERSION variable, which leads to
undefined VERSION macro in src/init.c.
Add VERSION=$(SYSVINIT_VERSION) to SYSVINIT_MAKE_OPTS to make the VERSION
environment variable available in the src/Makefile.
Signed-off-by: Cody Green <cody@londelec.com>
Signed-off-by: Thomas Petazzoni <thomas.petazzoni@bootlin.com>
(cherry picked from commit 954098b142)
Signed-off-by: Peter Korsgaard <peter@korsgaard.com>
The check-package tool requires some PyPi package to be installed before
it can run. This is typically done by manually installing them into the
user's global Python environment or setting up a virtual environment,
then manually installing each dependency.
Python recently defined a format for managing script dependencies as
inline metadata[1]. This can be used with the `uv` tool to run a Python
script and automatically install the minimum required version of Python
and PyPi dependencies.
With this change, it's now possible to run check-package with
uv run -s ./utils/check-package
Note that, because check-package does not have the '.py' file extension
we must specify the `-s` or `--script` argument. That argument was added
very recently in release 0.4.19[2].
I set the minimum python to 3.9 as that is the oldest version still
supported[3]. I verified 3.9 works by running
uv run -p 3.9 -s ./utils/check-package `git ls-tree -r --name-only HEAD` --ignore-list=.checkpackageignore
[1] https://packaging.python.org/en/latest/specifications/inline-script-metadata/#script-type
[2] https://github.com/astral-sh/uv/releases/tag/0.4.19
[3] https://devguide.python.org/versions/
Signed-off-by: Brandon Maier <brandon.maier@collins.com>
Signed-off-by: Thomas Petazzoni <thomas.petazzoni@bootlin.com>
(cherry picked from commit 6ffcdb52e8)
Signed-off-by: Peter Korsgaard <peter@korsgaard.com>
Call out the requirements to run check-package and mention that Docker
can be used to run check-package without installing dependencies.
Signed-off-by: Brandon Maier <brandon.maier@collins.com>
Signed-off-by: Thomas Petazzoni <thomas.petazzoni@bootlin.com>
(cherry picked from commit 68de69c4d7)
Signed-off-by: Peter Korsgaard <peter@korsgaard.com>
When compiling jailhouse with BR2_PACKAGE_JAILHOUSE_HELPER_SCRIPTS=y,
installation is failing with error:
/bin/sh: -c: line 1: syntax error near unexpected token ')'
This error is due to an extra ')' character in the macro
JAILHOUSE_INSTALL_HELPER_SCRIPTS.
This commit fixes this typo.
Signed-off-by: Raimundo Sagarzazu <rai.sagarzazu@outlook.com>
[Julien: reworded the commit log]
Signed-off-by: Julien Olivain <ju.o@free.fr>
(cherry picked from commit 10d25d98ed)
Signed-off-by: Peter Korsgaard <peter@korsgaard.com>
This patch fixes the following error:
arpd.c:442:17: error: initialization of 'int' from 'void *' makes integer from pointer without a cast [-Wint-conversion]
442 | NULL, 0,
The analysis of socket.h [1] containing the msghdr structure shows that
it has been modified with the addition of padding fields, which cause
the compilation error:
struct msghdr {
void *msg_name;
socklen_t msg_namelen;
struct iovec *msg_iov;
#if __LONG_MAX > 0x7fffffff && __BYTE_ORDER == __BIG_ENDIAN
int __pad1;
#endif
int msg_iovlen;
#if __LONG_MAX > 0x7fffffff && __BYTE_ORDER == __LITTLE_ENDIAN
int __pad1;
#endif
void *msg_control;
#if __LONG_MAX > 0x7fffffff && __BYTE_ORDER == __BIG_ENDIAN
int __pad2;
#endif
socklen_t msg_controllen;
#if __LONG_MAX > 0x7fffffff && __BYTE_ORDER == __LITTLE_ENDIAN
int __pad2;
#endif
int msg_flags;
};
The use of designated initializers allows the issue to be fixed.
[1] iproute2/host/mips64-buildroot-linux-musl/sysroot/usr/include/sys/socket.h
Fixes:
- http://autobuild.buildroot.org/results/e4cdfa38ae9578992f1c0ff5c4edae3cc0836e3c
Signed-off-by: Dario Binacchi <dario.binacchi@amarulasolutions.com>
Signed-off-by: Thomas Petazzoni <thomas.petazzoni@bootlin.com>
(cherry picked from commit 57d94b293b)
Signed-off-by: Peter Korsgaard <peter@korsgaard.com>
I still follow Buildroot development and use it for some personal
projects, but no longer have the time to be an active contributor.
Some of these are important defconfigs and packages to have up-to-date
in Buildroot, and mostly other developers have been doing that work, so
I am dropping them so that someone from the active contributors can be
the maintainer contact for them.
Signed-off-by: Erico Nunes <nunes.erico@gmail.com>
Signed-off-by: Thomas Petazzoni <thomas.petazzoni@bootlin.com>
(cherry picked from commit 1dc370cc90)
Signed-off-by: Peter Korsgaard <peter@korsgaard.com>
This vulnerability only affects libcurl deployments in Nest products
because of incorrect use.
Signed-off-by: Baruch Siach <baruch@tkos.co.il>
Signed-off-by: Thomas Petazzoni <thomas.petazzoni@bootlin.com>
(cherry picked from commit 7e739d49b2)
Signed-off-by: Peter Korsgaard <peter@korsgaard.com>
When I initially made the CVE cells collapsible, I neglected to
count the unsure CVEs. This patch adds unsure CVEs to the cell collapsing
calcualation to ensure that cells with lots of unsure CVEs actually get collapsed.
This patch also removes the "+ 1" from the cve_total calculation,
which fixes the cve_total being off-by-one.
I'm not sure *why* I did that in the first place.
demo:
https://sen-h.codeberg.page/pkg-stats-demos/@pages/add-unsure_cves-to-cve_total-calc.html
Signed-off-by: Sen Hastings <sen@hastings.org>
Signed-off-by: Thomas Petazzoni <thomas.petazzoni@bootlin.com>
(cherry picked from commit 87b8428c40)
Signed-off-by: Peter Korsgaard <peter@korsgaard.com>
Security fixes:
- gzip: prevent a hang when processing a malformed gzip inside a gzip
(#2366, OSS-Fuzz)
- tar: don't crash on truncated tar archives (#2364, OSS-Fuzz)
- tar: fix two leaks in tar header parsing (#2377)
Important bugfixes:
- 7-zip: read/write symlink paths as UTF-8 (#2252)
- cpio: exit with an error code if an entry could not be extracted (#2371)
- rar5: report encrypted entries (#2096)
- tar: fix truncation of entry pathnames in specific archives (#2360)
Signed-off-by: Francois Perrad <francois.perrad@gadz.org>
Signed-off-by: Thomas Petazzoni <thomas.petazzoni@bootlin.com>
(cherry picked from commit 55d0c9a9a6)
[Peter: mark as security bump]
Signed-off-by: Peter Korsgaard <peter@korsgaard.com>
The denx.de/wiki/U-Boot link now redirects to docs.u-boot.org/en/latest
Replace the link to the new location for the U-Boot documentation
Signed-off-by: Bryan Brattlof <bb@ti.com>
Signed-off-by: Thomas Petazzoni <thomas.petazzoni@bootlin.com>
(cherry picked from commit 164d9f0546)
Signed-off-by: Peter Korsgaard <peter@korsgaard.com>
2024-11-06 21:49:42 +01:00
191 changed files with 2650 additions and 689 deletions
Some files were not shown because too many files have changed in this diff
Show More
Reference in New Issue
Block a user
Blocking a user prevents them from interacting with repositories, such as opening or commenting on pull requests or issues. Learn more about blocking a user.