When compiling jailhouse with BR2_PACKAGE_JAILHOUSE_HELPER_SCRIPTS=y,
build is failing with error:
Traceback (most recent call last):
File "/buildroot/output/build/jailhouse-e57d1eff6d55aeed5f977fe4e2acfb6ccbdd7560/setup.py", line 18, in <module>
setup(name="pyjailhouse", version=version,
File "/buildroot/output/host/lib/python3.12/site-packages/setuptools/__init__.py", line 108, in setup
return distutils.core.setup(**attrs)
^^^^^^^^^^^^^^^^^^^^^^^^^^^^^
...
File "/buildroot/output/host/lib/python3.12/sysconfig.py", line 549, in _init_posix
_temp = __import__(name, globals(), locals(), ['build_time_vars'], 0)
^^^^^^^^^^^^^^^^^^^^^^^^^^^^^^^^^^^^^^^^^^^^^^^^^^^^^^^^^^^^^
ValueError: Empty module name
This is due to a missing dependency on the target python3 package.
Jailhouse Python scripts are using setuptools with host-python3 which
reads its sysconfig data from the target-python3. See:
https://gitlab.com/buildroot.org/buildroot/-/blob/2024.08.1/package/pkg-python.mk?ref_type=tags#L33
If the target python3 is not installed, this get expanded as an empty
string, leading to this "ValueError: Empty module name" error.
Pure Python packages which are using the python-package infrastructure
usually get this dependency automatically from:
https://gitlab.com/buildroot.org/buildroot/-/blob/2024.08.1/package/pkg-python.mk?ref_type=tags#L295
Here, the jailhouse package rather uses the generic-package
infrastructure, then installs the Python scripts (if enabled) with
dedicated macros. This is why the target python3 is needed.
This commit fixes the issue by adding this missing dependency.
Signed-off-by: Julien Olivain <ju.o@free.fr>
Signed-off-by: Thomas Petazzoni <thomas.petazzoni@bootlin.com>
(cherry picked from commit c808e271e3)
Signed-off-by: Peter Korsgaard <peter@korsgaard.com>
0001-nano.patch: both MOD_NANO and MOD_TAI were added to glibc 2.12
on 2011-03-30 in commit 83fe108b0a9bc4f2deb14695bb0c8b2011e79f28.
They were added to musl 0.7.5 in commit f5ba2bc9c on 2011-03-18. And
they were added to uClibc 1.0.23 in commit 2d8ea0524b on 2017-03-17. We
consider all of these old enough to assume they always exist.
Renumber the remaining patches.
Signed-off-by: Yegor Yefremov <yegorslists@googlemail.com>
Signed-off-by: Arnout Vandecappelle <arnout@mind.be>
(cherry picked from commit eee73d0cc0)
Signed-off-by: Peter Korsgaard <peter@korsgaard.com>
Fix pthread_detach() detection that is broken when building
with GCC 14.x:
checking for pthread_kill... yes
checking for pthread_rwlock_destroy with <pthread.h>... yes
checking for pthread_detach with <pthread.h>... no
configure: error: could not locate pthread_detach()
make[1]: *** [package/pkg-generic.mk:273:
/home/user/buildroot/bsp-barebox/build/ntp-4.2.8p17/.stamp_configured]
Error 1
make: *** [Makefile:82: _all] Error 2
Reference: https://bugs.ntp.org/show_bug.cgi?id=3926
Additionally, refresh patch 0002 to fix the offset of hunk 1.
Signed-off-by: Yegor Yefremov <yegorslists@googlemail.com>
Signed-off-by: Yann E. MORIN <yann.morin.1998@free.fr>
(cherry picked from commit 40d0797027)
Signed-off-by: Peter Korsgaard <peter@korsgaard.com>
This is bugfix release of stable libmdbx branch.
The most significant fixes since v0.12.10 (the previous version pinned to
buildroot):
- Fixed the possibility of `SIGSEGV` inside the `coherence_check()` after
changing the geometry by another process with an increase in the upper
DB size above the previous in-process limit.
- Fixed cursor(s) handling opened in parent transactions and closed before
the completion of nested/child transactions. In such case, closed
cursors were "resurrected", which led to a leak of memory allocated for
such cursors.
- Fixed a possibility of `SIGSEGV` when enabling logging of the
`MDBX_LOG_TRACE` level in debug builds.
- Correction of the missing `TXN_END_EOTDONE` in the case the start of
a reading transaction fails. The mentioned bit-flag was missing in the
transaction destruction/shutdown path on error its launch. Because of
this, an attempt was made to destroy the cursors, which led to crash
debug builds, since the corresponding array is intentionally filled
with poison pointers.
- Modification of `mdbx_close_by()` to return an error when trying to
close the dbi descriptor of a table created and/or modified in a
still-running transaction. Such premature closure of the descriptor is
an incorrect use of the API and a violation of the contract/preconditions
formulated in the description of `mdbx_close_dbi()`.
However, instead of returning an error, an incorrect closure of the
descriptor was performed, which could lead to the creation of a table
with an empty name, leakage of database pages and/or corruption of a
b-tree structure (wrong reference to the root of a table).
The complete ChangeLog:
https://gitflic.ru/project/erthink/libmdbx/blob?file=ChangeLog.md
Signed-off-by: Леонид Юрьев (Leonid Yuriev) <leo@yuriev.ru>
Signed-off-by: Thomas Petazzoni <thomas.petazzoni@bootlin.com>
(cherry picked from commit 81e7806b93)
Signed-off-by: Peter Korsgaard <peter@korsgaard.com>
in e97fc89e7b a dependency on host-gcc >= 7 was added but
for the comment the condition was not correctly inverted.
Fixes: e97fc89e7b ("package/protobuf-c: bump to version 1.5.0")
Signed-off-by: Michael Nosthoff <buildroot@heine.tech>
Signed-off-by: Thomas Petazzoni <thomas.petazzoni@bootlin.com>
(cherry picked from commit 84ef9bede6)
Signed-off-by: Peter Korsgaard <peter@korsgaard.com>
When BR2_LINUX_KERNEL_IMAGE_TARGET_CUSTOM=y,
BR2_LINUX_KERNEL_IMAGE_TARGET_NAME is supposed to be non-empty. But in
the context of genraconfig, we don't know to what value
BR2_LINUX_KERNEL_IMAGE_TARGET_NAME can be set, so let's avoid cases
where BR2_LINUX_KERNEL_IMAGE_TARGET_CUSTOM=y. By dropping this option,
kconfig will revert back to the default image format for the selected
architecture.
Fixes:
http://autobuild.buildroot.net/results/1d104a051c83bb31e98565369a2ec7badfa21eca/
Signed-off-by: Thomas Petazzoni <thomas.petazzoni@bootlin.com>
(cherry picked from commit b07d21ab98)
Signed-off-by: Peter Korsgaard <peter@korsgaard.com>
Generating Bitcoins to an address can take longer than the current
timeout, on slow runners. This commit fixes this issue by increasing
the timeout on specific commands. This issue was also observed more
frequently on newer bitcoin-core version 28.0.
Fixes:
https://gitlab.com/buildroot.org/buildroot/-/jobs/7782083081
Signed-off-by: Julien Olivain <ju.o@free.fr>
Signed-off-by: Thomas Petazzoni <thomas.petazzoni@bootlin.com>
(cherry picked from commit 859c4ea5f7)
Signed-off-by: Peter Korsgaard <peter@korsgaard.com>
Since commit: https://git.postgresql.org/gitweb/?p=postgresql.git;a=commit;h=52afe563206e753f4c45c014fee2459ad0855826
postgrsql fails to build with toolchains without threads support:
misc.c: In function 'ecpg_gettext':
misc.c:541:51: error: 'PTHREAD_MUTEX_INITIALIZER' undeclared (first use in this function)
541 | static pthread_mutex_t binddomain_mutex = PTHREAD_MUTEX_INITIALIZER;
| ^~~~~~~~~~~~~~~~~~~~~~~~~
misc.c:541:51: note: each undeclared identifier is reported only once for each function it appears in
misc.c:552:24: warning: implicit declaration of function 'pthread_mutex_lock' [-Wimplicit-function-declaration]
552 | (void) pthread_mutex_lock(&binddomain_mutex);
| ^~~~~~~~~~~~~~~~~~
misc.c:569:24: warning: implicit declaration of function 'pthread_mutex_unlock' [-Wimplicit-function-declaration]
569 | (void) pthread_mutex_unlock(&binddomain_mutex);
| ^~~~~~~~~~~~~~~~~~~~
Option "--disable-thread-safety" will be dropped in PG 17, so
this patch is needed only for 16.x branch.
Fixes: 73dd1d6b96 ("package/postgresql: security bump version to 16.3")
Signed-off-by: Maxim Kochetkov <fido_max@inbox.ru>
Signed-off-by: Thomas Petazzoni <thomas.petazzoni@bootlin.com>
(cherry picked from commit 747a41c19c)
Signed-off-by: Peter Korsgaard <peter@korsgaard.com>
The package homepage http url redirects to https. This commit updates
this url to directly use https.
Signed-off-by: Julien Olivain <ju.o@free.fr>
Signed-off-by: Thomas Petazzoni <thomas.petazzoni@bootlin.com>
(cherry picked from commit 5440d6c446)
Signed-off-by: Peter Korsgaard <peter@korsgaard.com>
The package _SITE url only contains the latest version at a given point
in time. When a new version is published, it is replacing the old one.
This issue was not detected because the archive was downloaded from the
sources.buildroot.org backup mirror, when the primary source became
unavailable.
Since commit 559bb33ae "support/testing: do not use s.b.o" [1], the
runtime test infrastructure is disabling this backup mirror. This
makes the nmap runtime test failing [2], which is using liblinear as
a dependency.
The liblinear package author confirmed in a private email that all the
releases, including the latest version, are all kept in the "oldfiles"
directory.
This commit fixes this download issue by updating the _SITE url to that
location. While at it, this commit also change the url to use https
(since the http equivalent redirects to https).
Fixes:
- [2]
[1] https://gitlab.com/buildroot.org/buildroot/-/commit/559bb33ae71dd2358ca2314ccb24b56cc3809fc1
[2] https://gitlab.com/buildroot.org/buildroot/-/jobs/7948008007
Signed-off-by: Julien Olivain <ju.o@free.fr>
Signed-off-by: Thomas Petazzoni <thomas.petazzoni@bootlin.com>
(cherry picked from commit 8b18c67f26)
Signed-off-by: Peter Korsgaard <peter@korsgaard.com>
This fixes the following runtime error when importing PyQt5 in python:
from PyQt5.QtCore import *
ModuleNotFoundError: No module named 'PyQt5.sip'
The problem was likely triggered by the atomic upgrade from 5.7 to
5.15 in b36ce7e. This commit is part of the 2022-2024 LTS.
Signed-off-by: Ralf Dragon <hypnotoad@lindra.de>
Tested-by: Andreas Naumann <anaumann@ultratronik.de>
Signed-off-by: Julien Olivain <ju.o@free.fr>
(cherry picked from commit ba09a448f1)
[Peter: reword commit summary]
Signed-off-by: Peter Korsgaard <peter@korsgaard.com>
Version environment variable VERSION=$(VERSION) is set in the top level
Makefile of the sysvinit:
$(MAKE) VERSION=$(VERSION) -C src $@
Build command SYSVINIT_BUILD_CMDS doesn't use the top level Makefile, but
src/Makefile instead without setting the VERSION variable, which leads to
undefined VERSION macro in src/init.c.
Add VERSION=$(SYSVINIT_VERSION) to SYSVINIT_MAKE_OPTS to make the VERSION
environment variable available in the src/Makefile.
Signed-off-by: Cody Green <cody@londelec.com>
Signed-off-by: Thomas Petazzoni <thomas.petazzoni@bootlin.com>
(cherry picked from commit 954098b142)
Signed-off-by: Peter Korsgaard <peter@korsgaard.com>
The check-package tool requires some PyPi package to be installed before
it can run. This is typically done by manually installing them into the
user's global Python environment or setting up a virtual environment,
then manually installing each dependency.
Python recently defined a format for managing script dependencies as
inline metadata[1]. This can be used with the `uv` tool to run a Python
script and automatically install the minimum required version of Python
and PyPi dependencies.
With this change, it's now possible to run check-package with
uv run -s ./utils/check-package
Note that, because check-package does not have the '.py' file extension
we must specify the `-s` or `--script` argument. That argument was added
very recently in release 0.4.19[2].
I set the minimum python to 3.9 as that is the oldest version still
supported[3]. I verified 3.9 works by running
uv run -p 3.9 -s ./utils/check-package `git ls-tree -r --name-only HEAD` --ignore-list=.checkpackageignore
[1] https://packaging.python.org/en/latest/specifications/inline-script-metadata/#script-type
[2] https://github.com/astral-sh/uv/releases/tag/0.4.19
[3] https://devguide.python.org/versions/
Signed-off-by: Brandon Maier <brandon.maier@collins.com>
Signed-off-by: Thomas Petazzoni <thomas.petazzoni@bootlin.com>
(cherry picked from commit 6ffcdb52e8)
Signed-off-by: Peter Korsgaard <peter@korsgaard.com>
Call out the requirements to run check-package and mention that Docker
can be used to run check-package without installing dependencies.
Signed-off-by: Brandon Maier <brandon.maier@collins.com>
Signed-off-by: Thomas Petazzoni <thomas.petazzoni@bootlin.com>
(cherry picked from commit 68de69c4d7)
Signed-off-by: Peter Korsgaard <peter@korsgaard.com>
When compiling jailhouse with BR2_PACKAGE_JAILHOUSE_HELPER_SCRIPTS=y,
installation is failing with error:
/bin/sh: -c: line 1: syntax error near unexpected token ')'
This error is due to an extra ')' character in the macro
JAILHOUSE_INSTALL_HELPER_SCRIPTS.
This commit fixes this typo.
Signed-off-by: Raimundo Sagarzazu <rai.sagarzazu@outlook.com>
[Julien: reworded the commit log]
Signed-off-by: Julien Olivain <ju.o@free.fr>
(cherry picked from commit 10d25d98ed)
Signed-off-by: Peter Korsgaard <peter@korsgaard.com>
I still follow Buildroot development and use it for some personal
projects, but no longer have the time to be an active contributor.
Some of these are important defconfigs and packages to have up-to-date
in Buildroot, and mostly other developers have been doing that work, so
I am dropping them so that someone from the active contributors can be
the maintainer contact for them.
Signed-off-by: Erico Nunes <nunes.erico@gmail.com>
Signed-off-by: Thomas Petazzoni <thomas.petazzoni@bootlin.com>
(cherry picked from commit 1dc370cc90)
Signed-off-by: Peter Korsgaard <peter@korsgaard.com>
This vulnerability only affects libcurl deployments in Nest products
because of incorrect use.
Signed-off-by: Baruch Siach <baruch@tkos.co.il>
Signed-off-by: Thomas Petazzoni <thomas.petazzoni@bootlin.com>
(cherry picked from commit 7e739d49b2)
Signed-off-by: Peter Korsgaard <peter@korsgaard.com>
When I initially made the CVE cells collapsible, I neglected to
count the unsure CVEs. This patch adds unsure CVEs to the cell collapsing
calcualation to ensure that cells with lots of unsure CVEs actually get collapsed.
This patch also removes the "+ 1" from the cve_total calculation,
which fixes the cve_total being off-by-one.
I'm not sure *why* I did that in the first place.
demo:
https://sen-h.codeberg.page/pkg-stats-demos/@pages/add-unsure_cves-to-cve_total-calc.html
Signed-off-by: Sen Hastings <sen@hastings.org>
Signed-off-by: Thomas Petazzoni <thomas.petazzoni@bootlin.com>
(cherry picked from commit 87b8428c40)
Signed-off-by: Peter Korsgaard <peter@korsgaard.com>
Security fixes:
- gzip: prevent a hang when processing a malformed gzip inside a gzip
(#2366, OSS-Fuzz)
- tar: don't crash on truncated tar archives (#2364, OSS-Fuzz)
- tar: fix two leaks in tar header parsing (#2377)
Important bugfixes:
- 7-zip: read/write symlink paths as UTF-8 (#2252)
- cpio: exit with an error code if an entry could not be extracted (#2371)
- rar5: report encrypted entries (#2096)
- tar: fix truncation of entry pathnames in specific archives (#2360)
Signed-off-by: Francois Perrad <francois.perrad@gadz.org>
Signed-off-by: Thomas Petazzoni <thomas.petazzoni@bootlin.com>
(cherry picked from commit 55d0c9a9a6)
[Peter: mark as security bump]
Signed-off-by: Peter Korsgaard <peter@korsgaard.com>
The denx.de/wiki/U-Boot link now redirects to docs.u-boot.org/en/latest
Replace the link to the new location for the U-Boot documentation
Signed-off-by: Bryan Brattlof <bb@ti.com>
Signed-off-by: Thomas Petazzoni <thomas.petazzoni@bootlin.com>
(cherry picked from commit 164d9f0546)
Signed-off-by: Peter Korsgaard <peter@korsgaard.com>
Add a test that runs the dtc commandline tools. To test devicetree
compilation, we use an example devicetree from the dtc project. The
example source is GPL-2.0+ licensed.
Signed-off-by: Brandon Maier <brandon.maier@gmail.com>
Signed-off-by: Arnout Vandecappelle <arnout@mind.be>
(cherry picked from commit 9b69034160)
Signed-off-by: Peter Korsgaard <peter@korsgaard.com>
linux-pam 1.2.0 removed the use of yywrap, so the flex dependency is not
needed now (host-flex is still needed).
Fixes: #47
Signed-off-by: Damien Thébault <damien.thebault@gmail.com>
Signed-off-by: Arnout Vandecappelle <arnout@mind.be>
(cherry picked from commit 600e273487)
Signed-off-by: Peter Korsgaard <peter@korsgaard.com>
3.7.5 fixed a number of security issues:
fix multiple vulnerabilities identified by SAST (#2251, #2256)
cpio: ignore out-of-range gid/uid/size/ino and harden AFIO parsing (#2258)
lzop: prevent integer overflow (#2174)
rar4: protect copy_from_lzss_window_to_unp() (#2172, CVE-2024-20696)
rar4: fix CVE-2024-26256 (#2269, CVS-2024-26256)
rar4: fix OOB in delta and audio filter (#2148, #2149)
rar4: fix out of boundary access with large files (#2179)
rar4: add boundary checks to rgb filter (#2210)
rar4: fix OOB access with unicode filenames (#2203)
rar5: clear 'data ready' cache on window buffer reallocs (#2265)
rpm: calculate huge header sizes correctly (#2158)
unzip: unify EOF handling (#2175)
util: fix out of boundary access in mktemp functions (#2160)
uu: stop processing if lines are too long (#2168)
And 3.7.6 fixed a tar regression introduced in 3.7.5
Signed-off-by: Francois Perrad <francois.perrad@gadz.org>
Signed-off-by: Thomas Petazzoni <thomas.petazzoni@bootlin.com>
(cherry picked from commit ab3c84e5e2)
[Peter: mark as security bump]
Signed-off-by: Peter Korsgaard <peter@korsgaard.com>
Doctoring a defconfig is tedious, and it is not easy to update a
defconfig, as it requires manual copy-pasting, adding comments and so
on...
Instead, just require defconfigs to be generated with 'savedefconfig'.
Any details can/must be provided in the commit log.
Reported-by: Edgar Bonet <bonet@grenoble.cnrs.fr>
Signed-off-by: Yann E. MORIN <yann.morin.1998@free.fr>
Signed-off-by: Arnout Vandecappelle <arnout@mind.be>
(cherry picked from commit 17bdd10cb3)
Signed-off-by: Peter Korsgaard <peter@korsgaard.com>
Release notes: https://www.python.org/downloads/release/python-31110/
Fixes CVE-2024-4032, CVE-2024-6232, CVE-2024-6923, CVE-2024-7592,
CVE-2024-8088 and CVE-2023-27043.
The fixes for bundled libexpat are irrelevant for us because external expat
is used.
Signed-off-by: Peter Korsgaard <peter@korsgaard.com>
This version fixes an out-of-bound reads in the MLSD command, so upgrading is recommended.
It also improves compatibility with various systems.
Update the COPYING hash because of a change in copyright year
Signed-off-by: Michael Fischer <mf@go-sys.de>
Signed-off-by: Peter Korsgaard <peter@korsgaard.com>
(cherry picked from commit 5271e90a6a)
Signed-off-by: Peter Korsgaard <peter@korsgaard.com>
Also add a missing article one line above.
Signed-off-by: Peter Korsgaard <peter@korsgaard.com>
[Arnout: fix additional typo]
Signed-off-by: Arnout Vandecappelle <arnout@mind.be>
(cherry picked from commit 4390361bb5)
Signed-off-by: Peter Korsgaard <peter@korsgaard.com>
Upstream curl commit f057de5a1a950 ("libcurl.pc: add `Requires.private`,
`Requires` for static linking") deals with proper pkg-config
configuration since version 8.9.0.
Our local libcurl.pc modification we added back in commit 61d322c3d2
(package/cURL: fix static link whith openSSL) is no longer needed.
Signed-off-by: Baruch Siach <baruch@tkos.co.il>
[yann.morin.1998@free.fr: this is not a "revert", reword commit log]
Signed-off-by: Yann E. MORIN <yann.morin.1998@free.fr>
(cherry picked from commit a5cef5339b)
Signed-off-by: Peter Korsgaard <peter@korsgaard.com>
Commit 89d39fc7a3 "initscripts: new package" moved the inittab
packaged for Busybox init from system/skeleton/etc to package/busybox.
The manual, however, still points to the old location, so let's fix it.
Signed-off-by: Edgar Bonet <bonet@grenoble.cnrs.fr>
Signed-off-by: Yann E. MORIN <yann.morin.1998@free.fr>
(cherry picked from commit 99b1685fd8)
Signed-off-by: Peter Korsgaard <peter@korsgaard.com>
Signed-off-by: Peter Korsgaard <peter@korsgaard.com>
[yann.morin.1998@free.fr: s/contents/content/]
Signed-off-by: Yann E. MORIN <yann.morin.1998@free.fr>
(cherry picked from commit aa79ae24a8)
Signed-off-by: Peter Korsgaard <peter@korsgaard.com>
Commit a87abcf6da (Makefile: run PPD and RPATH fixup in host-fialize)
(sic) moved the fixups peviously done in prepare-sdk, to host-finalize.
This exposed a bug in fix-rpath, when RPATH contains multiple entries,
like: /PPD/host-foo/host/lib:/PPD/host-foo/host/lib/foo
In that situation, we want to get rid of /PPD/host-foo and replace it
with the finale HOST_DIR, so we mangle the RPATH with a sed expression.
However, that sed expression only ever replaces the first match, as it
is missing the 'g' option. Thus, the second (and following) parts of
RPATH are still referring to the PPD, and thus patchelf does not find it
relative to the final HOST_DIR, amd rops it. This eventually lead to a
final RPATH set as $ORIGIN/../lib instead of the expected
$ORIGIN/../lib:$ORIGIN/../lib/foo
This is the case for host-systemd, which installs some of its libraries
in $PREFIX/lib/systemd/ and adds an RPATH set appropriately to
/PPD/host-systemd/host/lib:/PPD/host-systemd/host/lib/systemd and that
gets incorrectly mangled.
Fixes: https://gitlab.com/buildroot.org/buildroot/-/issues/39
Also fix a typo in the comment just above.
Reported-by: José Luis Salvador Rufo @jlsalvador
Signed-off-by: Yann E. MORIN <yann.morin.1998@free.fr>
Tested-by: José Luis Salvador Rufo <salvador.joseluis@gmail.com>
Reviewed-by: José Luis Salvador Rufo <salvador.joseluis@gmail.com>
Tested-by: Adam Duskett <adam.duskett@amarulasolutions.com>
Reviewed-by: Adam Duskett <adam.duskett@amarulasolutions.com>
Signed-off-by: Peter Korsgaard <peter@korsgaard.com>
(cherry picked from commit 2100a76d9e)
Signed-off-by: Peter Korsgaard <peter@korsgaard.com>
Browsers nowadays complain about HTTP downloads (E.G. manual.pdf) from a
site served over HTTPS, so also use HTTPS for the nightly.buildroot.org
manual links.
Signed-off-by: Peter Korsgaard <peter@korsgaard.com>
(cherry picked from commit 06397d26a0)
Signed-off-by: Peter Korsgaard <peter@korsgaard.com>
The behaviour of asciidoc on my laptop (Debian 10.2.0-1) changed at the end
of last year, causing the BR2_VERSION logic to no longer work:
grep 'manual generated' buildroot-2023.02.*/docs/manual/manual.text
buildroot-2023.02.6/docs/manual/manual.text:Buildroot 2023.02.6 manual generated on 2023-10-16 08:41:26 UTC from
buildroot-2023.02.7/docs/manual/manual.text:Buildroot ${BR2_VERSION%%-git*} manual generated on 2023-11-14
buildroot-2023.02.8/docs/manual/manual.text:Buildroot ${BR2_VERSION%%-git*} manual generated on 2023-12-04
We don't really NEED to strip the -git suffix; indeed, for a git tag, there
would be not -git suffix, while for any other commit there will be one
and we want to see it (e.g. in the nightly manual, or on a development
branch locally).
So just drop that to unbreak the version output.
Signed-off-by: Peter Korsgaard <peter@korsgaard.com>
[yann.morin.1998@free.fr: explain why wew don't want to drop it]
Signed-off-by: Yann E. MORIN <yann.morin.1998@free.fr>
(cherry picked from commit ec270a0815)
Signed-off-by: Peter Korsgaard <peter@korsgaard.com>
The qemu.run() method can break when a command happens to output the
string "# " to stdout. This is because qemu.run() detects when a command
has completed by searching for the shell prompt, which by default is
"# ". It then captures everything before the "# " as the commands
output, causing the rest of output to be lost.
Instead use the pexpect libraries REPLWrapper to handle running
commands. It has hooks to set a custom prompt and avoid some other
pitfalls of wrapping a shell.
We unfortunately can't reuse replwrap._repl_sh directly, because it
tries to spawn a command while we already have a qemu started. So we
need to copy that code into _repl_sh_child. While we're at it, also
define our own prompt strings.
Signed-off-by: Brandon Maier <brandon.maier@collins.com>
[Arnout:
- Make all arguments to _repl_sh_spawn non-optional.
- Move non_printable_insert to a local variable instead of an argument,
we don't need to override it.
- Copy the comment from _repl_sh that explains why non_printable_insert
is needed.
- Add a comment about timeouts.
- Rename spawn to child (we don't actually spawn anything so this felt
more natural, even though the class
- Use single quotes instead of triple quotes, and explicitly escape the
nested quotes.
]
Signed-off-by: Arnout Vandecappelle <arnout@mind.be>
(cherry picked from commit 0cad947b96)
Signed-off-by: Peter Korsgaard <peter@korsgaard.com>
When the build host does not have a Python interpreter installed,
host-grub2 is failing to configure due to this missing interpreter.
Note that host-grub2 is the first package to fail because it is a
dependency of grub2. The grub2 target package has the same dependency
requirement.
The issue can be quickly reproduced on a host without Python with the
commands:
cat <<EOF >.config
BR2_aarch64=y
BR2_TARGET_GRUB2=y
BR2_TOOLCHAIN_EXTERNAL=y
EOF
make olddefconfig
make grub2
grub2 autotools configure.ac search for a Python interpreter since
upstream commit [1] 8b467844e "python: Use AM_PATH_PYTHON to determine
interpreter for gentpl.py", first included in grub v2.04 released
on 2019-07-04. For reference, grub2 has been updated to that version
in commit [2] ea7ec41c "boot/grub2: bump to verson 2.04".
This commit fixes the issue by adding the host-python3 dependency to
host-grub2 and grub2.
Fixes:
checking for a Python interpreter with version >= 2.6... none
configure: error: no suitable Python interpreter found
[1] https://git.savannah.gnu.org/gitweb/?p=grub.git;a=commitdiff;h=8b467844e11170077c8ca727c39d2bd36eeb5f08
[2] https://gitlab.com/buildroot.org/buildroot/-/commit/ea7ec41cf64e86a692ac45e0d012c6e8199ef110
Reported-by: Vincent Stehlé <vincent.stehle@arm.com>
Signed-off-by: Julien Olivain <ju.o@free.fr>
Signed-off-by: Yann E. MORIN <yann.morin.1998@free.fr>
(cherry picked from commit 86bb1b2360)
Signed-off-by: Peter Korsgaard <peter@korsgaard.com>
Samuel Martin has not been around in the Buildroot community for many,
many years. His last posting on the mailing list was on July 2018. So
let's not pretend those packages are actually maintained, and let's
stop spamming Samuel with lots of patches and autobuilder failures.
Signed-off-by: Thomas Petazzoni <thomas.petazzoni@bootlin.com>
Signed-off-by: Yann E. MORIN <yann.morin.1998@free.fr>
(cherry picked from commit d8b83b861c)
Signed-off-by: Peter Korsgaard <peter@korsgaard.com>
Fixes the following CVEs:
CVE-2024-24789: archive/zip: mishandling of corrupt central directory record
CVE-2024-24790: net/netip: unexpected behavior from Is methods for IPv4-mapped IPv6 addresses
View the release notes for more information:
https://go.dev/doc/devel/release#go1.22.4
Signed-off-by: Christian Stewart <christian@aperture.us>
Signed-off-by: Peter Korsgaard <peter@korsgaard.com>
(cherry picked from commit d6e0f1b622)
Signed-off-by: Peter Korsgaard <peter@korsgaard.com>
Add a third bootstrap stage with Go1.21.x necessary for go1.22 bootstrap.
go-bootstrap-stage1 is Go1.4.x, the final version to support bootstrap using a C
compiler (later versions require the Go compiler for bootstrapping).
See: https://go.dev/doc/install/source#bootstrapFromSource
go-bootstrap-stage2 is Go 1.19.13, the last version to support bootstrap using
the Go1.4.x compiler.
go-bootstrap-stage3 is Go 1.21.8, the last version to support bootstrap using
the Go1.19.13 compiler. Go 1.20 requires a minimum of go 1.17.13 to bootstrap.
See: https://go.dev/doc/go1.20#bootstrap
This patch is in preparation for bumping the host-go package to >go1.22.x, which
requires a minimum of Go1.20.x for bootstrap.
See: https://go.dev/doc/go1.22#bootstrap
Signed-off-by: Christian Stewart <christian@aperture.us>
[Arnout: add GOCACHE definition]
Signed-off-by: Arnout Vandecappelle <arnout@mind.be>
(cherry picked from commit f00eb37de9)
Signed-off-by: Peter Korsgaard <peter@korsgaard.com>
Rewrap the whole help text as with the typo fix the line is a bit
longer and no longer fits within the limits defined by our
check-package coding style checking.
Signed-off-by: Peter Korsgaard <peter@korsgaard.com>
Signed-off-by: Thomas Petazzoni <thomas.petazzoni@bootlin.com>
(cherry picked from commit 08926081d8)
Signed-off-by: Peter Korsgaard <peter@korsgaard.com>
WirePlumber is a PipeWire session manager, essential to the operation
of PipeWire in most use cases. It is not a graphical application,
nor does it support graphics in any way. It is only there to support
PipeWire and it should be kept together with PipeWire in the menus.
Signed-off-by: George Kiagiadakis <george.kiagiadakis@collabora.com>
Signed-off-by: Arnout Vandecappelle <arnout@mind.be>
(cherry picked from commit 14b1b8ca8d)
Signed-off-by: Peter Korsgaard <peter@korsgaard.com>
The two lines with the Buildroot version and the system os-release
details are rendered on a single line, "because Markdown".
Make that a two-item list, to be sure they are on properly rendered.
Signed-off-by: Yann E. MORIN <yann.morin.1998@free.fr>
(cherry picked from commit 6a1e297a31)
Signed-off-by: Peter Korsgaard <peter@korsgaard.com>
Signed-off-by: Peter Korsgaard <peter@korsgaard.com>
[yann.morin.1998@free.fr: also fix grammar]
Signed-off-by: Yann E. MORIN <yann.morin.1998@free.fr>
(cherry picked from commit e009783505)
Signed-off-by: Peter Korsgaard <peter@korsgaard.com>
Currently, the gdbinit is generated and installed during post install
hooks, either from the gdb package, or from the external-toolchain
package. When using per-package directories (PPD), the staging directory
of the either package is stored in the generated gdbinit, which is not
going to be valid when all the PPD staging dirs get merged into the
final staging: it would lack any library installed afterwards, i.e.
mostly everything would be missing (but the libraries from the C
toolchain in the case of an external toolchain).
Similarly, all the RPATH will point to various PPD drectories. This
does not cause any issue when the final host is aggregated, because the
PPD directories still exist when we call programs from there (e.g. from
the fs infra, or from post-image scripts).
However, we knew that would not always be possible to keep the PPD
directories: we have the prepare-sdk rule that runs a cleanup pass on
the RPATH, and also applies the generic PPD fixups.
When we introduced prepare-sdk in c32ad51cbf (core/sdk: generate the
SDK tarball ourselves), we did not yet have support for PPD for the host
directory, and especially, we did not have the host-finalize rule, which
was only introduced in d0f4f95e39 (Makefile: rework main directory
creation logic) which kick-started the introduction of PPD.
At that point, we did not realise that the rpath fixups from
prepare-sdk, would be better moved to the new host-finalize rule,
because that had no impact unless one would need an SDK.
Later, in 25e60fbe1c (Makefile: fix SDK relocation for
per-package-dirs), we eventually introduced the PPD generic fixups in
the prepare-sdk rule. Again, we did not realise that those fixups would
be better placed in the host-finalize rule rather than the prepare-sdk.
While fixing the RPATH in host-finalize is not critical, fixing up the
PPD paths actually is, as the gdbinit case demonstrate.
As such, move the PPD fixups to the host-finalize step, and while at it,
also move the RPATH fixups.
This now does not leave much to do in the prepare-sdk step, and that
could very well be moved to the host-finalize rule as well. However,
some people may have started to rely on prepare-sdk in its 6 years of
existence, and the little script it installs is not needed unless one
really needs an SDK. So leave it as it is for now.
Reported-by: Casey Reeves <casey@xogium.me>
Signed-off-by: Yann E. MORIN <yann.morin.1998@free.fr>
Tested-by: Casey Reeves <casey@xogium.me>
Cc: Thomas Petazzoni <thomas.petazzoni@bootlin.com>
Cc: Brandon Maier <Brandon.Maier@collins.com>
Tested-by: Brandon Maier <brandon.maier@collins.com>
Acked-by: TIAN Yuanhao <tianyuanhao3@163.com>
(cherry picked from commit a87abcf6da)
Signed-off-by: Peter Korsgaard <peter@korsgaard.com>
Following an email exchange with Conrad Sand, one of the maintainers of
the project, I learned that version 9.900.2 has been moved to
https://sourceforge.net/projects/arma/files/retired/.
This patch fixes the package download error, waiting for a subsequent
patch that will restore the previous URL to bump to a more recent
version.
Adding the .RETIRED suffix to the downloaded tarball generated the
following error:
armadillo-9.900.2.tar.xz.RETIRED: OK (sha256: d78658c9442addf7f718eb05881150ee3ec25604d06dd3af4942422b3ce26d05)
>>> armadillo 9.900.2 Extracting
buildroot/dl/armadillo/armadillo-9.900.2.tar.xz.RETIRED | buildroot/output/host/bin/tar --strip-components=1 -C buildroot/output/build/armadillo-9.900.2 -xf -
/bin/bash: line 1: buildroot/dl/armadillo/armadillo-9.900.2.tar.xz.RETIRED: Permission denied
buildroot/output/host/bin/tar: This does not look like a tar archive
buildroot/output/host/bin/tar: Exiting with failure status due to previous errors
make[1]: *** [package/pkg-generic.mk:213: buildroot/output/build/armadillo-9.900.2/.stamp_extracted] Error 2
which required the addition of ARMADILLO_EXTRACT_CMDS to be fixed.
Finally, it was also necessary to modify the tarball's hash.
Fixes:
- http://autobuild.buildroot.org/results/d4e9e7b453960a4f62a199344b30b729a4f235bc
Signed-off-by: Dario Binacchi <dario.binacchi@amarulasolutions.com>
Signed-off-by: Thomas Petazzoni <thomas.petazzoni@bootlin.com>
(cherry picked from commit f69fe48404)
Signed-off-by: Peter Korsgaard <peter@korsgaard.com>
Patch v1 not set to 'superseded' when replying to <message-id> with v2.
I'm using git version 2.46.0. The manual says the following is the
correct way to use the '--in-reply-to' option:
git send-email --in-reply-to=<message-id>
Signed-off-by: Roy Kollen Svendsen <roykollensvendsen@gmail.com>
Signed-off-by: Thomas Petazzoni <thomas.petazzoni@bootlin.com>
(cherry picked from commit 6677d9c4e1)
Signed-off-by: Peter Korsgaard <peter@korsgaard.com>
Replace the group name 'nogroup' with 'nobody' in the default ProFTPD
configuration file. This fixes the following error when starting the
server:
proftpd[110]: fatal: Group: Unknown group 'nogroup' on line 30 of '/etc/proftpd.conf'
Fixes: 0d887cc2b4 ("system: replace nogroup with nobody")
Signed-off-by: Mattia Narducci <mattianarducci1@gmail.com>
Signed-off-by: Peter Korsgaard <peter@korsgaard.com>
(cherry picked from commit 2383768cdf)
Signed-off-by: Peter Korsgaard <peter@korsgaard.com>
Fixes the following security issues:
- CVE-2024-31080: Heap buffer overread/data leakage in ProcXIGetSelectedEvents
- CVE-2024-31081: Heap buffer overread/data leakage in ProcXIPassiveGrabDevice
- CVE-2024-31082: Heap buffer overread/data leakage in ProcAppleDRICreatePixmap
- CVE-2024-31083: User-after-free in ProcRenderAddGlyphs
For more details, see thee security page of Xorg:
https://www.x.org/wiki/Development/Security/
Signed-off-by: Waldemar Brodkorb <wbx@openadk.org>
[Peter: add actual list of CVEs]
Signed-off-by: Peter Korsgaard <peter@korsgaard.com>
(cherry picked from commit e33db30aab)
Signed-off-by: Peter Korsgaard <peter@korsgaard.com>
I lack the time (and interest) to properly keep these entries up to
date, so drop them from my section.
Signed-off-by: Thomas Huth <huth@tuxfamily.org>
Signed-off-by: Thomas Petazzoni <thomas.petazzoni@bootlin.com>
(cherry picked from commit 6fdbab87a2)
Signed-off-by: Peter Korsgaard <peter@korsgaard.com>
The following build failure on xtensa:
Waf: Entering directory `/home/buildroot/instance-0/output-1/build/ntpsec-1.2.3/build/host'
[1/2] Processing ntpd/ntp_parser.y
[2/2] Compiling build/host/ntpd/ntp_parser.tab.c
gcc: error: unrecognized command-line option '-mlongcalls'
gcc: error: unrecognized command-line option '-mauto-litpools'
reveals that the target's CFLAGS are being used for host compilation.
The patch fixes the host compilation by correctly setting the CFLAGS to
be used.
It should be noted that the build script used by ntpsec applies CFLAGS
for host compilation and --cross-cflags for target compilation.
Fixes:
- http://autobuild.buildroot.org/results/9321a637f2c340ce8dcb24249676bb6c44d0dfc6
Signed-off-by: Dario Binacchi <dario.binacchi@amarulasolutions.com>
Signed-off-by: Thomas Petazzoni <thomas.petazzoni@bootlin.com>
(cherry picked from commit 064e4c09fa)
Signed-off-by: Peter Korsgaard <peter@korsgaard.com>
Disable RNG support so that following build failure does not happen:
In file included from ../../../../src/libstrongswan/plugins/plugin.h:28,
from wolfssl_plugin.h:34,
from wolfssl_plugin.c:29:
wolfssl_plugin.c: In function 'get_features':
../../../../src/libstrongswan/plugins/plugin_feature.h:321:119: error: 'FEATURE_WC_RNG' undeclared (first use in this function); did you mean 'FEATURE_RNG'?
321 | #define __PLUGIN_FEATURE_REGISTER(type, _f) (plugin_feature_t){ FEATURE_REGISTER, FEATURE_##type, .arg.reg.f = _f }
| ^~~~~~~~
../../../../src/libstrongswan/plugins/plugin_feature.h:332:73: note: in expansion of macro '__PLUGIN_FEATURE_REGISTER'
332 | #define _PLUGIN_FEATURE_REGISTER_RNG(type, f) __PLUGIN_FEATURE_REGISTER(type, f)
| ^~~~~~~~~~~~~~~~~~~~~~~~~
../../../../src/libstrongswan/plugins/plugin_feature.h:248:39: note: in expansion of macro '_PLUGIN_FEATURE_REGISTER_RNG'
248 | #define PLUGIN_REGISTER(type, f, ...) _PLUGIN_FEATURE_REGISTER_##type(type, f, ##__VA_ARGS__)
| ^~~~~~~~~~~~~~~~~~~~~~~~~
wolfssl_plugin.c:510:17: note: in expansion of macro 'PLUGIN_REGISTER'
510 | PLUGIN_REGISTER(RNG, wolfssl_rng_create),
| ^~~~~~~~~~~~~~~
../../../../src/libstrongswan/plugins/plugin_feature.h:321:119: note: each undeclared identifier is reported only once for each function it appears in
321 | #define __PLUGIN_FEATURE_REGISTER(type, _f) (plugin_feature_t){ FEATURE_REGISTER, FEATURE_##type, .arg.reg.f = _f }
| ^~~~~~~~
../../../../src/libstrongswan/plugins/plugin_feature.h:332:73: note: in expansion of macro '__PLUGIN_FEATURE_REGISTER'
332 | #define _PLUGIN_FEATURE_REGISTER_RNG(type, f) __PLUGIN_FEATURE_REGISTER(type, f)
| ^~~~~~~~~~~~~~~~~~~~~~~~~
../../../../src/libstrongswan/plugins/plugin_feature.h:248:39: note: in expansion of macro '_PLUGIN_FEATURE_REGISTER_RNG'
248 | #define PLUGIN_REGISTER(type, f, ...) _PLUGIN_FEATURE_REGISTER_##type(type, f, ##__VA_ARGS__)
| ^~~~~~~~~~~~~~~~~~~~~~~~~
wolfssl_plugin.c:510:17: note: in expansion of macro 'PLUGIN_REGISTER'
510 | PLUGIN_REGISTER(RNG, wolfssl_rng_create),
| ^~~~~~~~~~~~~~~
make[6]: *** [Makefile:659: wolfssl_plugin.lo] Error 1
Reported Upstream:
https://github.com/strongswan/strongswan/issues/2410
This build failure started since 5.9.11 update in commit
78959665b9.
Fixes:
http://autobuild.buildroot.net/results/278b3f74c48c858ae368d59069752adb69c05246
Signed-off-by: Waldemar Brodkorb <wbx@openadk.org>
Signed-off-by: Thomas Petazzoni <thomas.petazzoni@bootlin.com>
(cherry picked from commit 89d512729c)
Signed-off-by: Peter Korsgaard <peter@korsgaard.com>
Commit 8f88a644ed "support/scripts/apply-patches.sh: set the maximum
fuzz factor to 0" reduced the fuzz factor.
Due to this change, asterisk fails to build with output:
Applying 0004-install-samples-need-the-data-files.patch using patch:
patching file Makefile
Hunk #1 FAILED at 779.
1 out of 1 hunk FAILED -- saving rejects to file Makefile.rej
This commit rebase the package patches on the current package version.
Note: the patch 0005 is unchanged, as it is correct in its current
state.
Fixes:
- http://autobuild.buildroot.org/results/92d/92d58ecb67f11a6eb74695bc1efcc672f69a57a9
Signed-off-by: Julien Olivain <ju.o@free.fr>
Signed-off-by: Yann E. MORIN <yann.morin.1998@free.fr>
(cherry picked from commit a6fabd9610)
Signed-off-by: Peter Korsgaard <peter@korsgaard.com>
Commit 2f260084d5 (utils/genrandconfig: remove support for toolchain
CSV) kept the --no-toolchains-csv option, but in the rework forgot to
keep it as a bool, while argparse default is to expect a string.
Rather than re-introduce the action="store_true" which implies the
argument is a bool, explicit make it a bool.
Fixes: 2f260084d5
Reported-by: James Hilliard <james.hilliard1@gmail.com>
Signed-off-by: Yann E. MORIN <yann.morin.1998@free.fr>
Cc: Thomas Petazzoni <thomas.petazzoni@bootlin.com>
Signed-off-by: Thomas Petazzoni <thomas.petazzoni@bootlin.com>
(cherry picked from commit 4dbb87bb66)
Signed-off-by: Peter Korsgaard <peter@korsgaard.com>
Right now, genrandconfig just spits out the random messages from the
different make invocations, which isn't terribly useful. Instead,
let's redirect the output of make invocations to oblivion, and add
some more high level logging.
As part of this logging, we're interested to see how many iterations
were needed to find a valid configuration, so changed the loop logic
to count from 0 to 100 instead of from 100 to 0 so that we can easily
show the iteration number.
Signed-off-by: Thomas Petazzoni <thomas.petazzoni@bootlin.com>
Signed-off-by: Yann E. MORIN <yann.morin.1998@free.fr>
(cherry picked from commit ce3dedc26b)
Signed-off-by: Peter Korsgaard <peter@korsgaard.com>
In order to test that upstream sites are still working, we need to NOT
fallback to sources.buildroot.net for some builds.
As there is anyway a local cache in the autobuilder instances, we need
to do quite a lot of builds without any BR2_BACKUP_SITE configured to
have a chance to catch issues, which is why a 50% chance is used to
unset BR2_BACKUP_SITE.
Signed-off-by: Thomas Petazzoni <thomas.petazzoni@bootlin.com>
Signed-off-by: Yann E. MORIN <yann.morin.1998@free.fr>
(cherry picked from commit da5c25c9f9)
Signed-off-by: Peter Korsgaard <peter@korsgaard.com>
Before calling randpackageconfig/randconfig, we were pre-generating a
snippet of .config with:
(1) minimal.config
(2) BR2_CURL/BR2_WGET settings
(3) some random selection of init system, debug, runtime debug, etc
(4) enabling BR2_REPRODUCIBLE=y when diffoscope was found
Now that we only use randconfig, this whole fine-tuning is completely
irrelevant, as it gets overridden by "make randconfig".
(1) and (3) above are useless, as randconfig does all the
randomization that is needed.
However, we want to preserve (2) and (4) above, so we re-implement
those fixups, but *after* randconfig has done its job.
Signed-off-by: Thomas Petazzoni <thomas.petazzoni@bootlin.com>
Signed-off-by: Yann E. MORIN <yann.morin.1998@free.fr>
(cherry picked from commit 3d33d394c2)
Signed-off-by: Peter Korsgaard <peter@korsgaard.com>
Now that the support for generating a fully random configuration has
been well-tested, the whole mechanism based on a toolchain CSV isn't
really useful anymore, so let's drop it to simplify the logic.
Note that the autobuilder code still uses --{,no-}toolchains-csv, so we
can't remove those or the autobuilders would fail. Once all supported
branches no longer use those argumetns, we can drop them from the
autobuilder code, then ask people to update their runners, and we will
finally be able to drop those arguments. Eventually.
Signed-off-by: Thomas Petazzoni <thomas.petazzoni@bootlin.com>
[yann.morin.1998@free.fr: keep --{,no-}toolchains-csv and explain why]
Signed-off-by: Yann E. MORIN <yann.morin.1998@free.fr>
(cherry picked from commit 2f260084d5)
Signed-off-by: Peter Korsgaard <peter@korsgaard.com>
We have accumulated a whole bunch of very old fixups to avoid issues
with super old CT-NG toolchains, which we are not testing anymore, so
remove those fixups.
Signed-off-by: Thomas Petazzoni <thomas.petazzoni@bootlin.com>
Signed-off-by: Yann E. MORIN <yann.morin.1998@free.fr>
(cherry picked from commit 9e33882568)
Signed-off-by: Peter Korsgaard <peter@korsgaard.com>
The LICENSE file gets installed directly to the root of $(TARGET_DIR),
which clashes with other packages:
FileExistsError: File already exists: /home/autobuild/autobuild/instance-3/output-1/target/LICENSE
This commit fixes this issue for the python-unittest-xml-reporting
package. Other fixes will be needed for the other patches.
The issue in python-unittest-xml-reporting was introduced in upstream
commit c43427611390fba83ca13fbb5311bd8fece5048f, which first appeared
in v3.1.0. We switched from a pre-3.1.0 version to 3.2.0 in Buildroot
in commit 69ba1562d5, which was merged
in 2023.02.
Fixes:
http://autobuild.buildroot.net/results/2c91243b440087bbc7d051d65f553f59d05dd207/
Signed-off-by: Thomas Petazzoni <thomas.petazzoni@bootlin.com>
Signed-off-by: Yann E. MORIN <yann.morin.1998@free.fr>
(cherry picked from commit 182d3556a6)
Signed-off-by: Peter Korsgaard <peter@korsgaard.com>
The python-huepy has an incorrect data_files statement in its
setup.py, causing the LICENSE file to be installed directly as
$(TARGET_DIR)/LICENSE. This was detected because several packages were
doing this, and the second package doing
it (python-unittest-xml-reporting, fixed separately) was erroring out
when trying to overwrite this already existing file.
This commit fixes the case of python-huepy by adding a patch that has
been submitted upstream.
There are no autobuilder failures related to python-huepy, but this
was detected while fixing
http://autobuild.buildroot.net/results/2c91243b440087bbc7d051d65f553f59d05dd207/
for python-unittest-xml-reporting.
This bug has been in huepy since at least 2018, so this patch can be
backported to previous Buildroot versions.
Signed-off-by: Thomas Petazzoni <thomas.petazzoni@bootlin.com>
Signed-off-by: Yann E. MORIN <yann.morin.1998@free.fr>
(cherry picked from commit 4e78b2c8b1)
Signed-off-by: Peter Korsgaard <peter@korsgaard.com>
lib/print.c in gnu-efi contains some floating point computation. On
ARM soft-float configurations, these floating point operations
generate calls to __eabi_*() functions that are provided by
gcc. However, gnu-efi builds some freestanding code, so it doesn't
link with libgcc, and therefore the build fails with:
arm-buildroot-linux-gnueabi-ld: /output-1/build/gnu-efi-3.0.18//lib/print.c:1431:(.text+0x78c): undefined reference to `__aeabi_i2d'
arm-buildroot-linux-gnueabi-ld: /output-1/build/gnu-efi-3.0.18//lib/print.c:1431:(.text+0x7a0): undefined reference to `__aeabi_dsub'
arm-buildroot-linux-gnueabi-ld: /output-1/build/gnu-efi-3.0.18//lib/print.c:1431:(.text+0x7a4): undefined reference to `__aeabi_d2f'
arm-buildroot-linux-gnueabi-ld: /output-1/build/gnu-efi-3.0.18//lib/print.c:1432:(.text+0x7b4): undefined reference to `__aeabi_fcmplt'
arm-buildroot-linux-gnueabi-ld: /output-1/build/gnu-efi-3.0.18//lib/print.c:1438:(.text+0x7c8): undefined reference to `__aeabi_fmul'
arm-buildroot-linux-gnueabi-ld: /output-1/build/gnu-efi-3.0.18//lib/print.c:1440:(.text+0x7d4): undefined reference to `__aeabi_fcmpeq'
arm-buildroot-linux-gnueabi-ld: /output-1/build/gnu-efi-3.0.18//lib/print.c:1444:(.text+0x7f8): undefined reference to `__aeabi_fmul'
arm-buildroot-linux-gnueabi-ld: /output-1/build/gnu-efi-3.0.18//lib/print.c:1440:(.text+0x808): undefined reference to `__aeabi_fcmpeq'
arm-buildroot-linux-gnueabi-ld: /output-1/build/gnu-efi-3.0.18//lib/print.c:1440:(.text+0x818): undefined reference to `__aeabi_f2iz'
arm-buildroot-linux-gnueabi-ld: /output-1/build/gnu-efi-3.0.18//lib/print.c:1451:(.text+0x834): undefined reference to `__aeabi_i2f'
arm-buildroot-linux-gnueabi-ld: /output-1/build/gnu-efi-3.0.18//lib/print.c:1451:(.text+0x840): undefined reference to `__aeabi_fcmpeq'
arm-buildroot-linux-gnueabi-ld: /output-1/build/gnu-efi-3.0.18//lib/print.c:1453:(.text+0x858): undefined reference to `__aeabi_fmul'
arm-buildroot-linux-gnueabi-ld: /output-1/build/gnu-efi-3.0.18//lib/print.c:1451:(.text+0x860): undefined reference to `__aeabi_f2iz'
arm-buildroot-linux-gnueabi-ld: /output-1/build/gnu-efi-3.0.18//lib/print.c:1451:(.text+0x868): undefined reference to `__aeabi_i2f'
arm-buildroot-linux-gnueabi-ld: /output-1/build/gnu-efi-3.0.18//lib/print.c:1451:(.text+0x870): undefined reference to `__aeabi_fcmpeq'
arm-buildroot-linux-gnueabi-ld: /output-1/build/gnu-efi-3.0.18//lib/print.c:1451:(.text+0x89c): undefined reference to `__aeabi_f2iz'
Since we don't care about gnu-efi support on ARM soft-float
configurations, let's disable such configurations.
Note that we have chosen to use BR2_ARM_SOFT_FLOAT as we're for now
making this specific to ARM as we're not sure what is the situation on
other CPU architectures (for example RISC-V without FPU maybe). This
can be revisited once we get more data on the behavior on other CPU
architectures that can support soft-float.
Fixes:
http://autobuild.buildroot.net/results/98d955fd2fcf4a3db1ab46e4f553447031a23b92/
Signed-off-by: Thomas Petazzoni <thomas.petazzoni@bootlin.com>
Signed-off-by: Yann E. MORIN <yann.morin.1998@free.fr>
(cherry picked from commit b62f2f7f12)
Signed-off-by: Peter Korsgaard <peter@korsgaard.com>
Since the bump of gnu-efi to version 3.0.17 in Buildroot commit
fa9893ad8f, the build of gnu-efi fails
on ARM big endian and AArch64 big endian.
Indeed, since that bump, gnu-efi builds some "apps", using a special
linker file part of gnu-efi that explicitly sets the architecture:
OUTPUT_FORMAT("elf32-littlearm", "elf32-littlearm", "elf32-littlearm")
OUTPUT_FORMAT("elf64-littleaarch64", "elf64-littleaarch64", "elf64-littleaarch64")
Due to this, big endian builds are now failing:
armeb-buildroot-linux-gnueabi-ld: ../gnuefi/crt0-efi-arm.o: compiled for a big endian system and target is little endian
armeb-buildroot-linux-gnueabi-ld: failed to merge target specific data of file ../gnuefi/crt0-efi-arm.o
Since we are not really interested in supporting gnu-efi on ARM big
endian and AArch64 big endian and it is not supported upstream, let's
disabled on those architectures.
Fixes:
http://autobuild.buildroot.org/results/4d385d6759346e19664d0bded1e419f004f82b47/ (ARM big endian)
http://autobuild.buildroot.net/results/b6df43408ca4cd469962c96d49d9ac7935b6dbe9/ (AArch64 big endian)
Signed-off-by: Thomas Petazzoni <thomas.petazzoni@bootlin.com>
Signed-off-by: Yann E. MORIN <yann.morin.1998@free.fr>
(cherry picked from commit 308d2c9927)
Signed-off-by: Peter Korsgaard <peter@korsgaard.com>
Changes with nginx 1.26.2 14 Aug 2024
*) Security: processing of a specially crafted mp4 file by the
ngx_http_mp4_module might cause a worker process crash
(CVE-2024-7347).
Thanks to Nils Bars.
Signed-off-by: Waldemar Brodkorb <wbx@openadk.org>
Signed-off-by: Thomas Petazzoni <thomas.petazzoni@bootlin.com>
(cherry picked from commit 8f31fea6d0)
Signed-off-by: Peter Korsgaard <peter@korsgaard.com>
Fixes the following security issues:
- gh-115398: Allow controlling Expat >=2.6.0 reparse deferral
(CVE-2023-52425) by adding five new methods:
xml.etree.ElementTree.XMLParser.flush()
xml.etree.ElementTree.XMLPullParser.flush()
xml.parsers.expat.xmlparser.GetReparseDeferralEnabled()
xml.parsers.expat.xmlparser.SetReparseDeferralEnabled()
xml.sax.expatreader.ExpatParser.flush()
- gh-115243: Fix possible crashes in collections.deque.index() when the
deque is concurrently modified.
- gh-114572: ssl.SSLContext.cert_store_stats() and
ssl.SSLContext.get_ca_certs() now correctly lock access to the certificate
store, when the ssl.SSLContext is shared across multiple threads.
For more details, see the changelog:
https://docs.python.org/release/3.11.9/whatsnew/changelog.html#python-3-11-9
Signed-off-by: Peter Korsgaard <peter@korsgaard.com>
This commit backports two upstream patches needed to fix
CVE-2023-34410. According to the CVE details, both patches are needed
for the fix.
Signed-off-by: Thomas Petazzoni <thomas.petazzoni@bootlin.com>
Signed-off-by: Peter Korsgaard <peter@korsgaard.com>
This commit backports upstream patches that are needed to fix
CVE-2023-37369. The second one is the actual CVE fix, the first one is
needed to only backporting the second patch in a reasonable way.
Signed-off-by: Thomas Petazzoni <thomas.petazzoni@bootlin.com>
Signed-off-by: Peter Korsgaard <peter@korsgaard.com>
This commit backports upstream patches that are needed to fix
CVE-2023-51714. The second one is the actual CVE fix, the first one is
needed to only backporting the second patch in a reasonable way.
Signed-off-by: Thomas Petazzoni <thomas.petazzoni@bootlin.com>
Signed-off-by: Peter Korsgaard <peter@korsgaard.com>
This commit backports an upstream patch to fix CVE-2023-38197, which
requires 3 other patches to be backported in order to work properly.
Signed-off-by: Thomas Petazzoni <thomas.petazzoni@bootlin.com>
Signed-off-by: Peter Korsgaard <peter@korsgaard.com>
This commit backports some upstream commits to fix CVE-2023-32763.
To backport the CVE fix, we had to backport two other related patches
to make the backport reasonably clean/straightforward.
Signed-off-by: Thomas Petazzoni <thomas.petazzoni@bootlin.com>
Signed-off-by: Peter Korsgaard <peter@korsgaard.com>
FBGrab is a framebuffer screenshot program, capturing the
linux frambuffer and converting it to a png-picture.
linux framebuffer and converting it to a png-picture.
https://github.com/GunnarMonell/fbgrab
Some files were not shown because too many files have changed in this diff
Show More
Reference in New Issue
Block a user
Blocking a user prevents them from interacting with repositories, such as opening or commenting on pull requests or issues. Learn more about blocking a user.