Compare commits

..
223 Commits
Author SHA1 Message Date
Peter Korsgaard a73dd8f787 Update for 2024.02.3
Signed-off-by: Peter Korsgaard <peter@korsgaard.com>
2024-06-10 09:37:56 +02:00
J. Neuschäfer 10dd781eac micropython: Add patch to avoid textrel on arm/thumb
Signed-off-by: J. Neuschäfer <j.neuschaefer@gmx.net>
Signed-off-by: Yann E. MORIN <yann.morin.1998@free.fr>
(cherry picked from commit cc08d6f5d1)
Signed-off-by: Peter Korsgaard <peter@korsgaard.com>
2024-06-09 10:33:31 +02:00
Peter Seiderer ee6694e970 package/libopenssl: security bump to version 3.2.2
Fixes CVE-2024-4741 (for details see [1]).

[1] https://www.openssl.org/news/secadv/20240528.txt

Signed-off-by: Peter Seiderer <ps.report@gmx.net>
Signed-off-by: Peter Korsgaard <peter@korsgaard.com>
2024-06-08 21:14:18 +02:00
Peter Seiderer 79369cb165 package/git: bump version to 2.43.5
Fixes "git lfs" and "git annex" breakage/regressions (for details see [1]).

[1] https://lore.kernel.org/git/xmqqr0dheuw5.fsf@gitster.g/

Signed-off-by: Peter Seiderer <ps.report@gmx.net>
Signed-off-by: Peter Korsgaard <peter@korsgaard.com>
2024-06-08 21:13:50 +02:00
Roy Kollen Svendsen 1b93db30fa package/libffi: fix host build failure
Host build fails on updated Arch Linux desktop.

My current /usr/bin/gcc version is 14.1.1 20240522, where
implicit-function-declaration cause build to fail:

2024-06-05T07:03:20 libtool: compile:  /home/roy/hymatek/connexi-touchpanel-firmware/mxxf1/output/host/bin/ccache /usr/bin/gcc -DHAVE_CONFIG_H -I. -I.. -I. -I../include -Iinclude -I../src -I/home/roy/hymatek/connexi-touchpanel-firmware/mxxf1/output/host/include -Wall -O2 -I/home/roy/hymatek/connexi-touchpanel-firmware/mxxf1/output/host/include -fexceptions -c ../src/tramp.c  -fPIC -DPIC -o src/.libs/tramp.o
2024-06-05T07:03:20 ../src/tramp.c: In function ‘ffi_tramp_get_temp_file’:
2024-06-05T07:03:20 ../src/tramp.c:262:22: error: implicit declaration of function ‘open_temp_exec_file’ [-Wimplicit-function-declaration]
2024-06-05T07:03:20 262 |   tramp_globals.fd = open_temp_exec_file ();
2024-06-05T07:03:20 |                      ^~~~~~~~~~~~~~~~~~~

Patch from master was added to fix build.

Signed-off-by: Roy Kollen Svendsen <roy.kollen.svendsen@akersolutions.com>
Signed-off-by: Peter Korsgaard <peter@korsgaard.com>
2024-06-08 21:07:24 +02:00
Julien Olivain 73075706e9 package/octave: add optional {Graphics, Image}Magick++ support
Signed-off-by: Julien Olivain <ju.o@free.fr>
Signed-off-by: Yann E. MORIN <yann.morin.1998@free.fr>
(cherry picked from commit 9f39676bdb)
Signed-off-by: Peter Korsgaard <peter@korsgaard.com>
2024-06-08 21:05:16 +02:00
Peter Korsgaard 01e7df5745 package/go: security bump to go1.21.11
Fixes the following CVEs:

CVE-2024-24789: archive/zip: mishandling of corrupt central directory record
CVE-2024-24790: net/netip: unexpected behavior from Is methods for IPv4-mapped IPv6 addresses

Signed-off-by: Peter Korsgaard <peter@korsgaard.com>
2024-06-08 20:26:56 +02:00
Fiona Klute 454728710b package/kmod: fix build with musl
Patch from upstream PR still being discussed:
https://github.com/kmod-project/kmod/pull/32

Fixes: #16093

Signed-off-by: Fiona Klute <fiona.klute+wiwa@gmx.de>
[yann.morin.1998@free.fr:
  - add upstream tag to the patch
  - reference #16093
]
Signed-off-by: Yann E. MORIN <yann.morin.1998@free.fr>
(cherry picked from commit 05617724ee)
Signed-off-by: Peter Korsgaard <peter@korsgaard.com>
2024-06-08 20:24:16 +02:00
Raphaël Mélotte 658686c6df docs/manual: document python-aiohttp needed for pkg-stats
Signed-off-by: Raphaël Mélotte <raphael.melotte@mind.be>
Signed-off-by: Peter Korsgaard <peter@korsgaard.com>
(cherry picked from commit 095bd205ae)
Signed-off-by: Peter Korsgaard <peter@korsgaard.com>
2024-06-08 20:23:39 +02:00
Martin Whitaker c263883991 board/freescale/common/imx/imx8-bootloader-prepare.sh: fix FIT external position
When using imx-mkimage 6.1.36_2.1.0 or later, an additional data structure
is inserted in the generated image. The FIT external data position passed
to the uboot mkimage program needs to be adjusted accordingly.

Fixes: https://bugs.busybox.net/show_bug.cgi?id=15973
Fixes: 72de789023 ("package/imx-mkimage: bump version to lf-6.1.36-2.1.0")
Tested-by: Sébastien Szymanski <sebastien.szymanski@armadeus.com>
[Sébastien: Tested on i.MX8MM EVK and i.MX8MP EVK]
[Sébastien:
 - fix subject
 - add Tested-by tag
 - fix Fixes tags
]
Signed-off-by: Sébastien Szymanski <sebastien.szymanski@armadeus.com>
Signed-off-by: Peter Korsgaard <peter@korsgaard.com>
(cherry picked from commit baaf7f738a)
Signed-off-by: Peter Korsgaard <peter@korsgaard.com>
2024-06-08 20:22:13 +02:00
James Hilliard de9436e29d package/vala: bump to version 0.56.17
Fixes:
http://autobuild.buildroot.net/results/f08/f087b879167252690ed198de771292142c6249f8/

Set GI_GIRDIR env variable which is now required for configure
to function.

Details:
https://gitlab.gnome.org/GNOME/vala/-/commit/a9d38070ce86d7994b949f7cb426fbf670a953d8

Signed-off-by: James Hilliard <james.hilliard1@gmail.com>
[yann.morin.1998@free.fr: drop spurious reflow of _DEPENDENCIES]
Signed-off-by: Yann E. MORIN <yann.morin.1998@free.fr>
(cherry picked from commit 3d4896c529)
Signed-off-by: Peter Korsgaard <peter@korsgaard.com>
2024-06-08 20:21:09 +02:00
James Hilliard 97d7a8e9c8 utils/genrandconfig: drop glibc Linaro toolchain version check
It has been well over 10 years since glibc 2.14 was released; the last
Debian version that had an earlier glibc was Wheezy, which Freexian
stopped to maintain as an ELTS in June 2020, 4 years ago, while the
oldest still maintained Ubuntu has glibc 2.21. It is now safe to assume
glibc 2.14 on all major, relevant distributions nowadays.

The distutils module is no longer bundled with python 3.12 so this
eliminates the need to install additional python modules under python
3.12.

Signed-off-by: James Hilliard <james.hilliard1@gmail.com>
[yann.morin.1998@free.fr: add Debian and Ubuntu references]
Signed-off-by: Yann E. MORIN <yann.morin.1998@free.fr>
(cherry picked from commit 929a491f40)
Signed-off-by: Peter Korsgaard <peter@korsgaard.com>
2024-06-08 20:18:57 +02:00
Romain Naour d9bb7bb688 package/systemd: add optional tpm2 dependency
When tpm2-tss package is selected, systemd can enable its TPM2 support
[1] used by systemd-boot, systemd-cryptenroll (when cryptsetup package
is also enabled) [2] and other tool systemd-pcr{extend,lock,machine}.

[1] https://github.com/systemd/systemd/blob/db11bab38ccf1ed257f310d29070843d4c58ea01/meson.build#L1341
[2] https://www.freedesktop.org/software/systemd/man/latest/systemd-cryptenroll.html

Signed-off-by: Romain Naour <romain.naour@smile.fr>
Signed-off-by: Peter Korsgaard <peter@korsgaard.com>
(cherry picked from commit 0e567a1580)
Signed-off-by: Peter Korsgaard <peter@korsgaard.com>
2024-06-08 20:18:27 +02:00
Romain Naour 2a026ca501 package/tpm2-tss: create tss user and group for tpm /dev nodes
When systemd and tpm2-tss with fapi support are enabled, the fakeroot
script fail with:

    <stdin>:35: Failed to resolve user 'tss': No such process.

When fapi support is enabled, tpm2-tss package install additional
configuration files that are expecting tss user and group exist [1].

  /etc/sysusers.d/tpm2-tss.conf
  /etc/tmpfiles.d/tpm2-tss-fapi.conf

The build fail in the fakeroot environment while handling tmpfiles
installed by tpm2-tss with fapi by host-systemd.

tss user and group is currently created by the tpm2-abrmd package but
tpm2-tss package also provide a udev rule file tpm-udev.rules [2] that
set the ownership of dev nodes /dev/tpmX and /dev/tpmrmX to tss
user/group. So tpm2-tss package must define TPM2_TSS_USERS to create
tss user and group, not tpm2-abrmd package.

So, move TPM2_ABRMD_USERS to TPM2_TSS_USERS.

Note: tpm2-abrmd is nowadays deprecated since the in-kernel Resource
      Manager (available since kernel 4.12) is preferred [3].

[1] https://github.com/tpm2-software/tpm2-tss/blob/4.1.3/INSTALL.md?plain=1#L184
[2] https://github.com/tpm2-software/tpm2-tss/blob/4.1.3/dist/tpm-udev.rules
[3] https://github.com/tpm2-software/tpm2-abrmd/blob/3.0.0/README.md?plain=1#L39

Signed-off-by: Romain Naour <romain.naour@smile.fr>
Signed-off-by: Peter Korsgaard <peter@korsgaard.com>
(cherry picked from commit 2cdd3d1ccf)
Signed-off-by: Peter Korsgaard <peter@korsgaard.com>
2024-06-08 20:15:32 +02:00
Yegor Yefremov 4e5b4b26bf DEVELOPERS: add Yegor Yefremov for package/ncftp
Signed-off-by: Yegor Yefremov <yegorslists@googlemail.com>
Signed-off-by: Peter Korsgaard <peter@korsgaard.com>
(cherry picked from commit 9703351e3f)
Signed-off-by: Peter Korsgaard <peter@korsgaard.com>
2024-06-08 20:12:25 +02:00
Peter Korsgaard a360f66358 Config.in: drop --passive-ftp from default wget options
Fedora has recently migrated to wget2, which has dropped ftp support and the
--passive-ftp command line option:

https://fedoraproject.org/wiki/Changes/Wget2asWget

It turns out that the command line option also doesn't do anything for wget1
as it was made the default in wget 1.10:

https://git.savannah.gnu.org/cgit/wget.git/tree/NEWS?h=v1.13#n292

wget 1.10 is from 2005, so it is safe to assume that all supported
distributions use >= 1.10.

Signed-off-by: Peter Korsgaard <peter@korsgaard.com>
Signed-off-by: Yann E. MORIN <yann.morin.1998@free.fr>
(cherry picked from commit 1a61c1d9b1)
Signed-off-by: Peter Korsgaard <peter@korsgaard.com>
2024-06-08 20:12:16 +02:00
Peter Korsgaard b4af299085 package/proftpd: download from github
The tarball is also available over https from github, so use that instead.

Signed-off-by: Peter Korsgaard <peter@korsgaard.com>
Signed-off-by: Yann E. MORIN <yann.morin.1998@free.fr>
(cherry picked from commit eca3ea8d3f)
Signed-off-by: Peter Korsgaard <peter@korsgaard.com>
2024-06-08 20:09:37 +02:00
Peter Korsgaard 32fbe9e54c package/zip: download from sourceforge
The tarball (with .tar.gz extension but same content) is also available over
https from sourceforge, so use that instead.

Signed-off-by: Peter Korsgaard <peter@korsgaard.com>
Signed-off-by: Yann E. MORIN <yann.morin.1998@free.fr>
(cherry picked from commit e5993e6cd4)
Signed-off-by: Peter Korsgaard <peter@korsgaard.com>
2024-06-08 20:09:29 +02:00
Peter Korsgaard 6720ffa694 package/ulogd: use https:// reference for .hash file
ftp.netfilter.org no longer provides ftp, so use the https:// url from
_SITE.

Signed-off-by: Peter Korsgaard <peter@korsgaard.com>
Signed-off-by: Yann E. MORIN <yann.morin.1998@free.fr>
(cherry picked from commit d36ce5f386)
Signed-off-by: Peter Korsgaard <peter@korsgaard.com>
2024-06-08 20:09:13 +02:00
Peter Korsgaard d88d2ccd3a package/ulogd: use https for _SITE
http redirects to https, so use that instead.

Signed-off-by: Peter Korsgaard <peter@korsgaard.com>
Signed-off-by: Yann E. MORIN <yann.morin.1998@free.fr>
(cherry picked from commit 0ec558208e)
Signed-off-by: Peter Korsgaard <peter@korsgaard.com>
2024-06-08 20:09:06 +02:00
Peter Korsgaard 4b0050f750 package/uboot-tools: use https:// _SITE
The tarballs are also available over https, so use that instead.

Signed-off-by: Peter Korsgaard <peter@korsgaard.com>
Signed-off-by: Yann E. MORIN <yann.morin.1998@free.fr>
(cherry picked from commit 9a47d734bd)
Signed-off-by: Peter Korsgaard <peter@korsgaard.com>
2024-06-08 20:08:58 +02:00
Peter Korsgaard f9af06dcff package/nfacct: use https:// reference for .hash file
ftp.netfilter.org no longer provides ftp, so use the https:// url from
_SITE.

Signed-off-by: Peter Korsgaard <peter@korsgaard.com>
Signed-off-by: Yann E. MORIN <yann.morin.1998@free.fr>
(cherry picked from commit d58b1dfa6d)
Signed-off-by: Peter Korsgaard <peter@korsgaard.com>
2024-06-08 20:08:43 +02:00
Peter Korsgaard 38a28aff85 package/nfacct: use https for _SITE
http redirects to https, so use that instead.

Signed-off-by: Peter Korsgaard <peter@korsgaard.com>
Signed-off-by: Yann E. MORIN <yann.morin.1998@free.fr>
(cherry picked from commit 5438d7d803)
Signed-off-by: Peter Korsgaard <peter@korsgaard.com>
2024-06-08 20:08:36 +02:00
Peter Korsgaard 61564410c9 package/newlib-bare-metal: use https:// _SITE
The tarballs are also available over https, so use that instead.

Signed-off-by: Peter Korsgaard <peter@korsgaard.com>
Reviewed-by: Neal Frager <neal.frager@amd.com>
Signed-off-by: Yann E. MORIN <yann.morin.1998@free.fr>
(cherry picked from commit 1f7de59273)
Signed-off-by: Peter Korsgaard <peter@korsgaard.com>
2024-06-08 20:08:25 +02:00
Peter Korsgaard a8485982aa package/ncftp: use https:// _SITE
The ftp server does not respond, so change to https:// instead.  Here the
3.2.6 version is under older_versions.

wget ftp://ftp.ncftp.com/ncftp/ncftp-3.2.6-src.tar.gz
--2024-06-03 08:10:44--  ftp://ftp.ncftp.com/ncftp/ncftp-3.2.6-src.tar.gz
           => ‘ncftp-3.2.6-src.tar.gz’
Resolving ftp.ncftp.com (ftp.ncftp.com)... 209.197.102.38
Connecting to ftp.ncftp.com (ftp.ncftp.com)|209.197.102.38|:21... ^C

http redirects to https, so update the help text to match.

Signed-off-by: Peter Korsgaard <peter@korsgaard.com>
Signed-off-by: Yann E. MORIN <yann.morin.1998@free.fr>
(cherry picked from commit 3eb84214a1)
Signed-off-by: Peter Korsgaard <peter@korsgaard.com>
2024-06-08 20:08:13 +02:00
Peter Korsgaard 8c03a60b3a package/lynx: use https:// _SITE
The ftp server does not allow anonymous login, causing the download to fail:

wget --passive-ftp -nd -t 3 -O '/home/peko/source/buildroot/output-qt/build/.lynx2.8.9rel.1.tar.bz2.XlcdCK/output' 'ftp://ftp.invisible-island.net/lynx/tarballs/lynx2.8.9rel.1.tar.bz2'
--2024-06-02 22:21:49--  ftp://ftp.invisible-island.net/lynx/tarballs/lynx2.8.9rel.1.tar.bz2
           => ‘/home/peko/source/buildroot/output-qt/build/.lynx2.8.9rel.1.tar.bz2.XlcdCK/output’
Resolving ftp.invisible-island.net (ftp.invisible-island.net)... 216.194.253.29
Connecting to ftp.invisible-island.net (ftp.invisible-island.net)|216.194.253.29|:21... connected.
Logging in as anonymous ...
Login incorrect.

Luckily the tarball is also available over https://, so use that instead.

Signed-off-by: Peter Korsgaard <peter@korsgaard.com>
[yann.morin.1998@free.fr:
  - use https, not http
  - drop trailing '/' in _SITE
]
Signed-off-by: Yann E. MORIN <yann.morin.1998@free.fr>
(cherry picked from commit d946d31325)
Signed-off-by: Peter Korsgaard <peter@korsgaard.com>
2024-06-08 20:08:05 +02:00
Peter Korsgaard 76528f05b5 package/libnetfilter_log: use https:// reference for .hash file
ftp.netfilter.org no longer provides ftp, so use the https:// url from
_SITE.

Signed-off-by: Peter Korsgaard <peter@korsgaard.com>
Signed-off-by: Yann E. MORIN <yann.morin.1998@free.fr>
(cherry picked from commit 07a44a2424)
Signed-off-by: Peter Korsgaard <peter@korsgaard.com>
2024-06-08 20:07:48 +02:00
Peter Korsgaard b7a7f87bc4 package/libnetfilter_log: use https for _SITE
http redirects to https, so use that instead.

Signed-off-by: Peter Korsgaard <peter@korsgaard.com>
Signed-off-by: Yann E. MORIN <yann.morin.1998@free.fr>
(cherry picked from commit 9f615dc406)
Signed-off-by: Peter Korsgaard <peter@korsgaard.com>
2024-06-08 20:07:38 +02:00
Peter Korsgaard 3779f0c522 package/libnetfilter_acct: use https:// reference for .hash file
ftp.netfilter.org no longer provides ftp, so use the https:// url from
_SITE.

Signed-off-by: Peter Korsgaard <peter@korsgaard.com>
Signed-off-by: Yann E. MORIN <yann.morin.1998@free.fr>
(cherry picked from commit af4038d0ce)
Signed-off-by: Peter Korsgaard <peter@korsgaard.com>
2024-06-08 20:07:31 +02:00
Peter Korsgaard 8e95fe54dc package/libnetfilter_acct: use https for _SITE
http redirects to https, so use that instead.

Signed-off-by: Peter Korsgaard <peter@korsgaard.com>
Signed-off-by: Yann E. MORIN <yann.morin.1998@free.fr>
(cherry picked from commit b530de097f)
Signed-off-by: Peter Korsgaard <peter@korsgaard.com>
2024-06-08 20:07:21 +02:00
Peter Korsgaard 4021703e86 package/libmnl: use upstream sha256sum
ftp.netfilter.org no longer provides ftp, so use the https:// url from
_SITE.

This provides a .sha256sum but NOT md5/sha1, so update the .hash file to
match.

Signed-off-by: Peter Korsgaard <peter@korsgaard.com>
Reviewed-by: Dario Binacchi <dario.binacchi@amarulasolutions.com>
Signed-off-by: Yann E. MORIN <yann.morin.1998@free.fr>
(cherry picked from commit 5cbcbf5078)
Signed-off-by: Peter Korsgaard <peter@korsgaard.com>
2024-06-08 20:06:56 +02:00
Peter Korsgaard c4d2430ca6 package/libmnl: use https for _SITE
http redirects to https, so use that instead.

Signed-off-by: Peter Korsgaard <peter@korsgaard.com>
Reviewed-by: Dario Binacchi <dario.binacchi@amarulasolutions.com>
Signed-off-by: Yann E. MORIN <yann.morin.1998@free.fr>
(cherry picked from commit 88dc6a6e49)
Signed-off-by: Peter Korsgaard <peter@korsgaard.com>
2024-06-08 20:06:50 +02:00
Peter Korsgaard 13cfe61a57 package/freeradius-server: use https:// _SITE
The tarballs are also available at
https://freeradius.org/ftp/pub/freeradius/, so use that instead.

Signed-off-by: Peter Korsgaard <peter@korsgaard.com>
Signed-off-by: Yann E. MORIN <yann.morin.1998@free.fr>
(cherry picked from commit f37a3fb498)
Signed-off-by: Peter Korsgaard <peter@korsgaard.com>
2024-06-08 20:06:44 +02:00
Peter Korsgaard 6c2951e863 package/freeradius-client: use https:// _SITE
The tarballs are also available at
https://freeradius.org/ftp/pub/freeradius/, so use that instead.

Signed-off-by: Peter Korsgaard <peter@korsgaard.com>
Signed-off-by: Yann E. MORIN <yann.morin.1998@free.fr>
(cherry picked from commit e30a0035e1)
Signed-off-by: Peter Korsgaard <peter@korsgaard.com>
2024-06-08 20:06:35 +02:00
Peter Korsgaard 8089a94c27 package/file: use https:// _SITE
ftp.astrom.com also serves the files over https://, so use that instead.

Signed-off-by: Peter Korsgaard <peter@korsgaard.com>
[yann.morin.1998@free.fr: use https, not http]
Signed-off-by: Yann E. MORIN <yann.morin.1998@free.fr>
(cherry picked from commit 02f6617b68)
Signed-off-by: Peter Korsgaard <peter@korsgaard.com>
2024-06-08 20:06:29 +02:00
Peter Korsgaard 87c7e98aa1 package/ebtables: switch to https://
For consistency, adapt the reference in the hash file too.

Signed-off-by: Peter Korsgaard <peter@korsgaard.com>
[yann.morin.1998@free.fr: switch to https as suggested by Baruch]
Signed-off-by: Yann E. MORIN <yann.morin.1998@free.fr>
(cherry picked from commit 1efc1e7b90)
Signed-off-by: Peter Korsgaard <peter@korsgaard.com>
2024-06-08 20:06:23 +02:00
Peter Korsgaard 0b880085c9 package/doom-wad: drop reference to ftp.idsoftware.com
The server was decommisioned in 2017 and is unlikely to ever come back, so
drop the reference:

https://www.doomworld.com/forum/topic/96999-rip-ftpidsoftwarecom/

Signed-off-by: Peter Korsgaard <peter@korsgaard.com>
Signed-off-by: Yann E. MORIN <yann.morin.1998@free.fr>
(cherry picked from commit a1d5e366b5)
Signed-off-by: Peter Korsgaard <peter@korsgaard.com>
2024-06-08 20:06:12 +02:00
Yann E. MORIN 90b9302e83 package/qt5base: fix download
Since qt5base was last bumped in 8ab4a0a348 (package/qt5: bump packages
to latest kde submodule versions), the hash for the downloaded tarball
has changed:

    $ make qt5base-source
    [...]
    ERROR: expected: 935d01f5c34903ad9e979431cec7a8a59332ed3fc539e639f5ba87e8d6989b9d
    ERROR: got     : 3067c4d84ba9927bfe65bf606c17af082199e0a3b22781fbf9bc6c6bc3de26dd

We know the hash was good back when 8ab4a0a348 was applied, because
the tarball has been cached on sources.buildroot.org with the expected
hash:

    $ curl 'https://sources.buildroot.net/qt5base/qtbase-da6e958319e95fe564d3b30c931492dd666bfaff.tar.bz2' 2>/dev/null |sha256sum -
    935d01f5c34903ad9e979431cec7a8a59332ed3fc539e639f5ba87e8d6989b9d  -

But now, the archive generated by the KDE gorge (Gitlab underneath) has
another hash (as seen above). This means that the KDE forge (Gitlab) has
changed the way it generates archives. So, what's the delta? It turns
out that the only changes are about CRLF that were present in the
original archive, and are no longer in the new one. It is to be noted
that the affected files do not have CRLFS in the repository. It further
turns out that the archive was previously generated with .gitattibutes
of the main branch ('dev' in Qt repositories), while now they are
generated with the .gitattibutes of the commit for which they are
generated.

Switch to using the git download method for really reproducible
archives...

Signed-off-by: Yann E. MORIN <yann.morin.1998@free.fr>
Cc: Sebastian Weyer <sebastian.weyer@smile.fr>
Cc: Peter Korsgaard <peter@korsgaard.com>
Signed-off-by: Peter Korsgaard <peter@korsgaard.com>
(cherry picked from commit 75da04c817)
[Peter: adjust for filename/hash used on 2024.02.x]
Signed-off-by: Peter Korsgaard <peter@korsgaard.com>
2024-06-08 20:04:02 +02:00
Yann E. MORIN 29df0eb414 package/pkg-download: use _DL_SUBDIR as root dir of generated archives
Currently, when we generate archives, e.g.  for git, svn, cargo or go, we
use the package _BASENAME_RAW as the root directory of the generated
archive.  For example, for package foo at version 1.2.3, that would generate
an archive rooted at foo-1.2.3/.

This is usually what we want, except in one specific condition: when the
package shares its download with another package *and* it is a generated
archive. In that case, the root directory will be different for each of
the two packages, which is incorrect, but was so far benign: we never
had any hash for such generated archives, and they were only generated
in two cases:
  - linux and linux-headers
  - barebox and barebox-aux

As we skip one directory depth when extracting the archives, we did not
care what the root directory was; whether it was that of one package or
the other was of no consequence.

But now that we can have hashes for archives generated from custom
versions, this breaks the usual case where the headers used for the
toolchains are those of the kernel to build for the target. In this
case, we may end up downloading the linux-headers package before we
download the linux package, so we'd get the hash for an archive rooted
at linux-headers-XXX/, but the one for the linux package the archive
would be rooted at linux-XXX/, or we may end up (e.g. with parallel
builds) downloading the linux package first and linux-headers next.

That would cause conflicts in hashes, as demonstrated by the only defconfig
we have in that situation, olimex_stmp157_olinuxino_lime_defconfig.

_BASENAME_RAW is a construct that is expanded to include the RAWNAME
followed by a dash and the version, if there is a version, or with just
the RAWNAME when there is no version.

We tweak the download macro to use _DL_SUBDIR followed by the version.

This is only used by VCS backends (cvs, git, svn...) and so there will
always be a version string, so no need to duplicate the case without a
version like is done for _BASENAME_RAW

_DL_SUBDIR defaults to _RAWNAME, so this is a noop by default, unless
the package declares it shares its download with another one, in which
case the generated archive will now be rooted as for the shared package.

This was triggered by:
    https://patchwork.ozlabs.org/project/buildroot/patch/20240602070634.597337-1-francois.perrad@gadz.org/

Reported-by: Peter Korsgaard <peter@korsgaard.com>
Signed-off-by: Yann E. MORIN <yann.morin.1998@free.fr>
Cc: Francois Perrad <francois.perrad@gadz.org>
Signed-off-by: Peter Korsgaard <peter@korsgaard.com>
(cherry picked from commit ebe238f2b5)
Signed-off-by: Peter Korsgaard <peter@korsgaard.com>
2024-06-08 19:56:23 +02:00
Peter Korsgaard 5a708e510a package/gcc-bare-metal: bump version to match gcc
The gcc 13.x. version was bumped to 13.3.0 by commit 5d9c54de0c
(package/gcc: update to 13.3.0), so update gcc-bare-metal to match.

Signed-off-by: Peter Korsgaard <peter@korsgaard.com>
2024-06-08 19:10:50 +02:00
Waldemar Brodkorb 5d9c54de0c package/gcc: update to 13.3.0
See here for changes made to this release:
https://gcc.gnu.org/bugzilla/buglist.cgi?bug_status=RESOLVED&resolution=FIXED&target_milestone=13.3

Signed-off-by: Waldemar Brodkorb <wbx@openadk.org>
Signed-off-by: Yann E. MORIN <yann.morin.1998@free.fr>
(cherry picked from commit f3b2f0f985)
Signed-off-by: Peter Korsgaard <peter@korsgaard.com>
2024-06-08 19:04:38 +02:00
Fiona Klute b89394cb62 package/dnsmasq: Fix init script restart command
Restarting dnsmasq can cause constant issues: stop works, but start
fails because the new instance can't bind the socket. Another restart
immediately after works just fine:

    # /etc/init.d/S80dnsmasq restart
    Stopping dnsmasq: OK
    Starting dnsmasq:
    dnsmasq: failed to create listening socket for 192.168.128.1: Address in use
    FAIL
    # /etc/init.d/S80dnsmasq restart
    Stopping dnsmasq: FAIL
    Starting dnsmasq: OK

Solve this by waiting for process to actually stop before returning
from the stop command. Clean up the PID file after to avoid potential
issues with the PID being reused after stop. The wait could also be
placed inside the restart block, but putting it into the stop block
has the advantage that it also avoids similar issues for any other
callers.

Signed-off-by: Fiona Klute <fiona.klute+wiwa@gmx.de>
[yann.morin.1998@free.fr:
  - fix shellcheck
  - reflow commit log
]
Signed-off-by: Yann E. MORIN <yann.morin.1998@free.fr>
(cherry picked from commit 507caef3dd)
Signed-off-by: Peter Korsgaard <peter@korsgaard.com>
2024-06-08 18:59:07 +02:00
Brandon Maier 74c55729b0 DEVELOPERS: add myself for package/mtd
Signed-off-by: Brandon Maier <brandon.maier@collins.com>
Signed-off-by: Yann E. MORIN <yann.morin.1998@free.fr>
(cherry picked from commit f6ad519824)
Signed-off-by: Peter Korsgaard <peter@korsgaard.com>
2024-06-08 18:55:47 +02:00
Brandon Maier 1605614475 package/mtd: switch to https mirror
As mentioned in the last release notes, there is an https mirror[1].
Switch to this as ftp is not as widely supported anymore.

[1] https://lists.infradead.org/pipermail/linux-mtd/2023-August/100922.html

Signed-off-by: Brandon Maier <brandon.maier@collins.com>
Signed-off-by: Yann E. MORIN <yann.morin.1998@free.fr>
(cherry picked from commit 7eb1ea5b65)
Signed-off-by: Peter Korsgaard <peter@korsgaard.com>
2024-06-08 18:54:57 +02:00
Brandon Maier bb0164a6d2 support/testing: add mtd test
Signed-off-by: Brandon Maier <brandon.maier@collins.com>
[yann.morin.1998@free.fr:
  - don't set an empty BR2_ENABLE_LOCALE_WHITELIST
]
Signed-off-by: Yann E. MORIN <yann.morin.1998@free.fr>
(cherry picked from commit 5806419b91)
Signed-off-by: Peter Korsgaard <peter@korsgaard.com>
2024-06-08 18:54:51 +02:00
Gero Schwäricke 6c2a12f96d {linux, linux-headers}: bump 4.19.x, 5.4.x, 5.10.x, 5.15.x, 6.1.x, 6.6.x, 6.8.x series
Signed-off-by: Gero Schwäricke <gero.schwaericke@grandcentrix.net>
Signed-off-by: Yann E. MORIN <yann.morin.1998@free.fr>
(cherry picked from commit a6784999b2)
[Peter: drop 6.8.x bump]
Signed-off-by: Peter Korsgaard <peter@korsgaard.com>
2024-06-08 18:53:47 +02:00
James Hilliard 58ec14fe8f utils/genrandconfig: switch to async/await format
This requires python 3.5 or newer but is a bit cleaner than the
previous coroutine method.

This should also fix a python3.12 issue:
[Tue, 28 May 2024 13:09:05] INFO: generate the configuration
Traceback (most recent call last):
  File "/home/autobuild/autobuild/instance-0/buildroot/utils/genrandconfig", line 833, in <module>
    ret = asyncio.run(gen_config(args))
          ^^^^^^^^^^^^^^^^^^^^^^^^^^^^^
  File "/usr/lib/python3.12/asyncio/runners.py", line 194, in run
    return runner.run(main)
           ^^^^^^^^^^^^^^^^
  File "/usr/lib/python3.12/asyncio/runners.py", line 89, in run
    raise ValueError("a coroutine was expected, got {!r}".format(coro))
ValueError: a coroutine was expected, got <generator object gen_config at 0xffff7bd822c0>
[Tue, 28 May 2024 13:09:06] WARN: failed to generate configuration

Signed-off-by: James Hilliard <james.hilliard1@gmail.com>
Reviewed-by: Vincent Fazio <vfazio@xes-inc.com>
Signed-off-by: Yann E. MORIN <yann.morin.1998@free.fr>
(cherry picked from commit 584ebdea6e)
Signed-off-by: Peter Korsgaard <peter@korsgaard.com>
2024-06-08 18:51:41 +02:00
Julien Olivain 626c967c5f package/octave: add optional bzip2 support
Signed-off-by: Julien Olivain <ju.o@free.fr>
Signed-off-by: Peter Korsgaard <peter@korsgaard.com>
(cherry picked from commit c1723c0dfd)
Signed-off-by: Peter Korsgaard <peter@korsgaard.com>
2024-06-08 18:50:16 +02:00
Adrian Perez de Castro 2a1f89db05 package/cog: bump to version 0.18.4
This is a small bugfix release, with a rendering fix for popup menus
and that can use weston-protocols version 14 for building. Release
notes:

  https://wpewebkit.org/release/cog-0.18.4.html

Signed-off-by: Adrian Perez de Castro <aperez@igalia.com>
Signed-off-by: Peter Korsgaard <peter@korsgaard.com>
(cherry picked from commit 091ad8455d)
Signed-off-by: Peter Korsgaard <peter@korsgaard.com>
2024-06-08 18:49:46 +02:00
Brandon Maier 3283e5f595 utils/add-custom-hashes: symlink linux-headers to linux
Most boards use BR2_KERNEL_HEADERS_AS_KERNEL with their custom kernels.
So when creating their custom hash files, the linux-headers.hash is the
same as linux.hash. In this case we symlink linux-headers to linux to
make maintenance easier. Update the add-custom-hashes tool to explicitly
handle this case.

Signed-off-by: Brandon Maier <brandon.maier@collins.com>
[Peter: use cmp -s]
Signed-off-by: Peter Korsgaard <peter@korsgaard.com>
(cherry picked from commit d506e232e7)
Signed-off-by: Peter Korsgaard <peter@korsgaard.com>
2024-06-08 18:49:04 +02:00
Julien Olivain bb8e3f45a6 package/ccache: always disable developer mode
Ccache CMake build system has some conditions that automatically
enables a developer mode (sets CCACHE_DEV_MODE=ON). See [1].

More specifically, if CCACHE_DEV_MODE is unset AND the environment
variable "CI" is set, CCACHE_DEV_MODE is set to "ON".

This situation can happen when Buildroot builds are executed in
Jenkins jobs, for example. Since Buildroot does not set
CCACHE_DEV_MODE and Jenkins sets the "CI" environment variable,
this ccache developer mode can be enabled in an unexpected way
for the Buildroot user. For example, it happened that a Jenkins build
breaks, while the build with the same configuration in the user
session is working.

One of the effects of enabling this ccache developer mode, is to treat
compiler warnings as errors, see [3]. This can lead to build error,
depending on the ccache version and the host compiler being used.

This behavior can be reproduced and observed, with commands:

    cat > .config <<EOF
    BR2_aarch64=y
    BR2_TOOLCHAIN_EXTERNAL=y
    BR2_CCACHE=y
    BR2_PACKAGE_BUSYBOX=y
    EOF
    make olddefconfig

    make clean
    make host-ccache

Outputs:

    ...
    -- Ccache version: 4.9.1
    -- Ccache dev mode: OFF
    -- Setting CMAKE_BUILD_TYPE to Release as none was specified.
    ...

Whereas:

    make clean
    CI=true make host-ccache

Outputs:

    ...
    -- Ccache version: 4.9.1
    -- Ccache dev mode: ON
    -- Setting CMAKE_BUILD_TYPE to Debug as none was specified.
    ...

For a failure example: on Fedora 40 with host gcc 14.1.1, Buildroot at
tag 2024.02 has ccache 4.8.2. Host ccache can fail, when building with
"CI=true make host-ccache" with output:

    /buildroot/output/build/host-ccache-4.8.2/src/third_party/fmt/core.h:3119:44:   in 'constexpr' expansion of 'fmt::v8::make_format_args<>(args#0, args#1)'
    /buildroot/output/build/host-ccache-4.8.2/src/third_party/fmt/core.h:1706:15: error: possibly dangling reference to a temporary [-Werror=dangling-reference]
     1706 |   const auto& arg = arg_mapper<Context>().map(std::forward<T>(val));
          |               ^~~

This commit sets CCACHE_DEV_MODE=OFF to make the ccache behavior more
deterministic in Buildroot, independently of being used in a CI tool
or not.

[1] https://github.com/ccache/ccache/blob/v4.9.1/CMakeLists.txt#L56
[2] https://github.com/jenkinsci/jenkins/blob/jenkins-2.459/core/src/main/java/jenkins/model/CoreEnvironmentContributor.java#L43
[3] https://github.com/ccache/ccache/blob/v4.9.1/cmake/StandardWarnings.cmake#L5

Reported-by: Xavier Roumegue <xroumegue@gmail.com>
Signed-off-by: Julien Olivain <ju.o@free.fr>
Signed-off-by: Peter Korsgaard <peter@korsgaard.com>
(cherry picked from commit 197be7ed87)
Signed-off-by: Peter Korsgaard <peter@korsgaard.com>
2024-06-08 18:47:06 +02:00
Alexander Mukhin ff7ef4994c DEVELOPERS: add Alexander Mukhin for package/zfs
Signed-off-by: Alexander Mukhin <alexander.i.mukhin@gmail.com>
Signed-off-by: Peter Korsgaard <peter@korsgaard.com>
(cherry picked from commit 3beef4b0d4)
Signed-off-by: Peter Korsgaard <peter@korsgaard.com>
2024-06-08 18:46:45 +02:00
Adrian Perez de Castro ee23cf19e0 package/wpewebkit: security bump to version 2.44.2
Update to the most recent stable release of WPE WebKit. As this is a
change to a newer release series, there are a few changes in the CMake
build options. Dependencies mostly remain the same. The main changes
are:

 - The new ENABLE_WEB_CODECS option is set along with ENABLE_VIDEO and
   ENABLE_WEB_RTC depending on BR2_PACKAGE_WPEWEBKIT_MULTIMEDIA.
 - The new USE_LIBBACKTRACE option is set accordingly, depending on
   BR2_PACKAGE_LIBBACKTRACE.
 - WebAssembly does not work with ENABLE_C_LOOP, so it needs to be
   disabled alongside it for MIPSr6, ARMv5 and ARMv6; not that building
   WebAssembly support is enabled by default.
 - ENABLE_ACCESSIBILITY has been removed, instead the new USE_ATK option
   can be used to the same effect.
 - JPEG2000 is no longer supported, the openjpeg dependency is removed.

Release notes and announcement:

  - https://wpewebkit.org/blog/2024-wpewebkit-2.44.html

  - https://wpewebkit.org/release/wpewebkit-2.44.0.html
  - https://wpewebkit.org/release/wpewebkit-2.44.1.html
  - https://wpewebkit.org/release/wpewebkit-2.44.2.html

Relevant security advisories:

  - https://wpewebkit.org/security/WSA-2024-0002.html
  - https://wpewebkit.org/security/WSA-2024-0003.html

Signed-off-by: Adrian Perez de Castro <aperez@igalia.com>
[Peter: use .tar.xz]
Signed-off-by: Peter Korsgaard <peter@korsgaard.com>
(cherry picked from commit 3d235a0689)
Signed-off-by: Peter Korsgaard <peter@korsgaard.com>
2024-06-08 18:46:27 +02:00
Adrian Perez de Castro de27070009 package/libwpe: bump to version 1.16.0
This new stable series brings in support for pointer lock, customization
of subprocess launching, and a build fix that allows using EGL
implementations that do not ship a pkg-config module. Version 1.16.x is
recommended for WPE WebKit 2.44.x, which will be updated in a follow-up
patch.

Release notes:

  https://wpewebkit.org/release/libwpe-1.16.0.html

Signed-off-by: Adrian Perez de Castro <aperez@igalia.com>
Signed-off-by: Peter Korsgaard <peter@korsgaard.com>
(cherry picked from commit 8845a796bb)
Signed-off-by: Peter Korsgaard <peter@korsgaard.com>
2024-06-08 18:46:12 +02:00
Alexander Mukhin b746f626cb package/tinyproxy: bump version to 1.11.2
Drop now included patch.

Signed-off-by: Alexander Mukhin <alexander.i.mukhin@gmail.com>
[Peter: drop patch from .checkpackageignore]
Signed-off-by: Peter Korsgaard <peter@korsgaard.com>
(cherry picked from commit 9fcdc50175)
Signed-off-by: Peter Korsgaard <peter@korsgaard.com>
2024-06-08 18:45:52 +02:00
Julien Olivain 82dec87ecc package/octave: add optional zlib support
Signed-off-by: Julien Olivain <ju.o@free.fr>
Signed-off-by: Peter Korsgaard <peter@korsgaard.com>
(cherry picked from commit fa54abf730)
Signed-off-by: Peter Korsgaard <peter@korsgaard.com>
2024-06-08 17:29:14 +02:00
Alexander Mukhin f5a4cc44ac package/zfs: bump version to 2.2.4
Signed-off-by: Alexander Mukhin <alexander.i.mukhin@gmail.com>
Signed-off-by: Peter Korsgaard <peter@korsgaard.com>
(cherry picked from commit 5746b8b371)
Signed-off-by: Peter Korsgaard <peter@korsgaard.com>
2024-06-08 17:28:15 +02:00
Peter Korsgaard 135d6d198e package/libarchive: security bump to version 3.7.4
Fixes the following security issues:

- CVE-2024-26256: libarchive Remote Code Execution Vulnerability
  https://github.com/advisories/GHSA-2jc9-36w4-pmqw

For more details, see the release notes:
https://github.com/libarchive/libarchive/releases/tag/v3.7.4

Signed-off-by: Peter Korsgaard <peter@korsgaard.com>
(cherry picked from commit c7a16c7919)
Signed-off-by: Peter Korsgaard <peter@korsgaard.com>
2024-06-08 17:27:14 +02:00
Thomas Devoogdt 4ae077510c package/weston: fix xcb-util-cursor dependency for xwayland
Run-time dependency xcb-cursor found: NO (tried pkgconfig and cmake)

../../br-test-pkg/bootlin-armv7-glibc/build/weston-13.0.0/tests/meson.build:340:2: ERROR: Problem encountered: xcb and xcb-cursor required for running xwayland tests

Fixes:
 - https://bugs.busybox.net/show_bug.cgi?id=15766

Signed-off-by: Thomas Devoogdt <thomas@devoogdt.com>
Signed-off-by: Peter Korsgaard <peter@korsgaard.com>
(cherry picked from commit fb952e1116)
Signed-off-by: Peter Korsgaard <peter@korsgaard.com>
2024-06-08 17:26:17 +02:00
Peter Korsgaard 25c23920ff configs/orangepi_pc_defconfig: u-boot 2024.01 needs host-openssl
Commit 2e349be94a (configs/orangepi_pc_defconfig: bump U-boot to
v2024.01 to fix compatibility with setuptools >= 69) bumped U-Boot, but
forgot to add a dependency on host-openssl.  Fix that.

Signed-off-by: Peter Korsgaard <peter@korsgaard.com>
(cherry picked from commit 96e41a849e)
Signed-off-by: Peter Korsgaard <peter@korsgaard.com>
2024-06-08 17:18:34 +02:00
Peter Korsgaard 520c2185b7 configs/orangepi_r1_defconfig: u-boot 2024.01 needs host-openssl
Fixes: https://gitlab.com/buildroot.org/buildroot/-/jobs/6918689094

Commit 113eeb55d6 (configs/orangepi_r1_defconfig: bump U-boot to v2024.01
to fix compatibility with setuptools >= 69) bumped U-Boot, but forgot to add
a dependency on host-openssl.  Fix that.

Signed-off-by: Peter Korsgaard <peter@korsgaard.com>
(cherry picked from commit 8eae5a07d2)
Signed-off-by: Peter Korsgaard <peter@korsgaard.com>
2024-06-08 17:18:28 +02:00
Fabrice Fontaine 22bd9931a3 package/dhcpcd: bump to version 10.0.8
https://github.com/NetworkConfiguration/dhcpcd/releases/tag/v10.0.8
https://github.com/NetworkConfiguration/dhcpcd/releases/tag/v10.0.7
https://github.com/NetworkConfiguration/dhcpcd/releases/tag/v10.0.6

Signed-off-by: Fabrice Fontaine <fontaine.fabrice@gmail.com>
[Peter: drop stray line in .mk]
Signed-off-by: Peter Korsgaard <peter@korsgaard.com>
(cherry picked from commit c4cae92b76)
Signed-off-by: Peter Korsgaard <peter@korsgaard.com>
2024-06-08 17:18:15 +02:00
Fabrice Fontaine 14c80da353 package/cryptodev-linux: fix build with kernel >= 6.7
Fix the following build failure with kernel >= 6.7:

/home/buildroot/autobuild/instance-0/output-1/build/cryptodev-linux-1.13/./cryptlib.c: In function ‘cryptodev_hash_init’:
/home/buildroot/autobuild/instance-0/output-1/build/cryptodev-linux-1.13/./cryptlib.c:384:28: error: implicit declaration of function ‘crypto_ahash_alignmask’; did you mean ‘crypto_aead_alignmask’? [-Werror=implicit-function-declaration]
  384 |         hdata->alignmask = crypto_ahash_alignmask(hdata->async.s);
      |                            ^~~~~~~~~~~~~~~~~~~~~~
      |                            crypto_aead_alignmask

Fixes:
 - http://autobuild.buildroot.org/results/466360c7baec2edf42dc6f0ad9a8d757dd471c88

Signed-off-by: Fabrice Fontaine <fontaine.fabrice@gmail.com>
Signed-off-by: Peter Korsgaard <peter@korsgaard.com>
(cherry picked from commit 15ec07403f)
Signed-off-by: Peter Korsgaard <peter@korsgaard.com>
2024-06-08 16:01:03 +02:00
Fabrice Fontaine cc7bffeb59 package/lua-cffi: fix or1k build
Fix the following or1k build failure raised since bump to version 0.2.2
in commit 079d992b27:

In file included from /home/buildroot/autobuild/run/instance-0/output-1/host/or1k-buildroot-linux-uclibc/sysroot/usr/include/lua.hpp:6,
                 from ../src/lua.hh:23,
                 from ../src/parser.hh:4,
                 from ../src/ffilib.cc:7:
../src/ffilib.cc: In static member function 'static void ffi_module::setup(lua_State*)':
../src/ffilib.cc:1616:28: error: expected ')' before 'FFI_ARCH_NAME'
 1616 |         lua_pushliteral(L, FFI_ARCH_NAME);
      |                            ^~~~~~~~~~~~~

Fixes: 079d992b27
 - http://autobuild.buildroot.org/results/4e14753732c5b6fe8ba9ecc4050ffb35f471c428

Signed-off-by: Fabrice Fontaine <fontaine.fabrice@gmail.com>
Signed-off-by: Peter Korsgaard <peter@korsgaard.com>
(cherry picked from commit 9b07b4bf6d)
Signed-off-by: Peter Korsgaard <peter@korsgaard.com>
2024-06-08 15:59:01 +02:00
Peter Korsgaard 019e0d31cd configs/orangepi_pc_defconfig: bump U-boot to v2024.01 to fix compatibility with setuptools >= 69
Fixes: https://gitlab.com/buildroot.org/buildroot/-/jobs/6865597706

setuptools.extern.packaging.version.InvalidVersion: Invalid version: 'u-boot-2020.10'
make[5]: *** [scripts/dtc/pylibfdt/Makefile:30: scripts/dtc/pylibfdt/_libfdt.so] Error 1
make[4]: *** [scripts/Makefile.build:419: scripts/dtc/pylibfdt] Error 2
make[4]: *** Waiting for unfinished jobs....
make[3]: *** [scripts/Makefile.build:419: scripts/dtc] Error 2
make[2]: *** [Makefile:577: scripts] Error 2
make[1]: *** [package/pkg-generic.mk:283: /builds/buildroot.org/buildroot/output/build/uboot-2020.10/.stamp_built] Error 2

Commit 6b62384e3d (package/python-setuptools: bump to version 69.0.3)
bumped setuptools, which now errors out when passed a version with a prefix
string.  This u-boot- prefix string is dropped since U-Boot 2023.01 with
commit c977b1843504 (libfdt: Fix invalid version warning), so bump U-Boot to
v2024.01 to fix this issue.

Signed-off-by: Peter Korsgaard <peter@korsgaard.com>
(cherry picked from commit 2e349be94a)
Signed-off-by: Peter Korsgaard <peter@korsgaard.com>
2024-06-08 15:57:14 +02:00
Fabrice Fontaine 03e4742cac package/x11vnc: drop unrecognized options
--without-{jpeg,sdl,zlib} are unrecognized since bump to version
0.9.14 in commit aeea662fb1 and
https://github.com/LibVNC/x11vnc/commit/d287ed9a77c647f35e85e0b10621a6661e911fad
because those dependencies were linked to libvncserver, not x11vnc

Fixes: aeea662fb1

Signed-off-by: Fabrice Fontaine <fontaine.fabrice@gmail.com>
Signed-off-by: Peter Korsgaard <peter@korsgaard.com>
(cherry picked from commit 3ead103f46)
Signed-off-by: Peter Korsgaard <peter@korsgaard.com>
2024-06-08 15:55:57 +02:00
Fabrice Fontaine 4b4becbd07 package/mutt: bump to version 2.2.13
Mutt 2.2.13 was released on March 9, 2024. This is a bug-fix release,
fixing a possible dangling pointer reference in the SMTP client.

Signed-off-by: Fabrice Fontaine <fontaine.fabrice@gmail.com>
Signed-off-by: Peter Korsgaard <peter@korsgaard.com>
(cherry picked from commit 730de6c00e)
Signed-off-by: Peter Korsgaard <peter@korsgaard.com>
2024-06-08 15:55:10 +02:00
Fabrice Fontaine ea425bf724 package/minisign: do not strip
Set CMAKE_STRIP to an empty value to avoid the following build failure
with BR2_BINFMT_FLAT raised since the addition of the package in commit
d90ac63d9b:

/home/buildroot/instance-0/output-1/host/bin/m68k-linux-strip: /home/buildroot/instance-0/output-1/build/minisign-0.11/minisign: file format not recognized

Fixes: d90ac63d9b
 - http://autobuild.buildroot.org/results/9cc9fd17c7eb4a741c08f27f69764df4a26295fa

Signed-off-by: Fabrice Fontaine <fontaine.fabrice@gmail.com>
Signed-off-by: Peter Korsgaard <peter@korsgaard.com>
(cherry picked from commit d96b3c331c)
Signed-off-by: Peter Korsgaard <peter@korsgaard.com>
2024-06-08 15:54:32 +02:00
Fabrice Fontaine 70455e092e package/putty: security bump to version 0.81
The only change between 0.80 and 0.81 is one security fix:

 - ECDSA signatures using 521-bit keys (the NIST P521 curve, otherwise
   known as ecdsa-sha2-nistp521) were generated with biased random
   numbers. This permits an attacker in possession of a few dozen
   signatures to RECOVER THE PRIVATE KEY.

   Any 521-bit ECDSA private key that PuTTY or Pageant has used to
   sign anything should be considered compromised.

   This vulnerability has the identifier CVE-2024-31497.

Update hash of LICENCE file (update in year with
https://git.tartarus.org/?p=simon/putty.git;a=commit;h=f2f28ac0386eebbd45ea605818d31d62d219f589)

https://lists.tartarus.org/pipermail/putty-announce/2024/000038.html

Signed-off-by: Fabrice Fontaine <fontaine.fabrice@gmail.com>
Signed-off-by: Peter Korsgaard <peter@korsgaard.com>
(cherry picked from commit bd6fa8d13b)
Signed-off-by: Peter Korsgaard <peter@korsgaard.com>
2024-06-08 15:53:38 +02:00
Maxim Kochetkov 2cd1932935 package/postgresql: security bump version to 16.3
Release notes: https://www.postgresql.org/about/news/postgresql-163-157-1412-1315-and-1219-released-2858/

Fixes CVE-2024-4317.

Signed-off-by: Maxim Kochetkov <fido_max@inbox.ru>
Signed-off-by: Peter Korsgaard <peter@korsgaard.com>
(cherry picked from commit 73dd1d6b96)
Signed-off-by: Peter Korsgaard <peter@korsgaard.com>
2024-06-08 15:53:06 +02:00
Peter Korsgaard 48e3dddd2f configs/orangepi_r1_defconfig: bump U-boot to v2024.01 to fix compatibility with setuptools >= 69
Fixes: https://gitlab.com/buildroot.org/buildroot/-/jobs/6865597717

setuptools.extern.packaging.version.InvalidVersion: Invalid version: 'u-boot-2020.10'
make[5]: *** [scripts/dtc/pylibfdt/Makefile:30: scripts/dtc/pylibfdt/_libfdt.so] Error 1
make[4]: *** [scripts/Makefile.build:419: scripts/dtc/pylibfdt] Error 2
make[4]: *** Waiting for unfinished jobs....
make[3]: *** [scripts/Makefile.build:419: scripts/dtc] Error 2
make[2]: *** [Makefile:577: scripts] Error 2
make[1]: *** [package/pkg-generic.mk:283: /builds/buildroot.org/buildroot/output/build/uboot-2020.10/.stamp_built] Error 2

Commit 6b62384e3d (package/python-setuptools: bump to version 69.0.3)
bumped setuptools, which now errors out when passed a version with a prefix
string.  This u-boot- prefix string is dropped since U-Boot 2023.01 with
commit c977b1843504 (libfdt: Fix invalid version warning), so bump U-Boot to
v2024.01 to fix this issue.

Signed-off-by: Peter Korsgaard <peter@korsgaard.com>
Signed-off-by: Romain Naour <romain.naour@smile.fr>
(cherry picked from commit 113eeb55d6)
Signed-off-by: Peter Korsgaard <peter@korsgaard.com>
2024-06-08 15:52:17 +02:00
Peter Korsgaard d45f3d03c2 configs/orangepi_r1_defconfig: drop double _HOST_UBOOT_TOOLS=y
Fixes the following warning:
orangepi_r1_defconfig:35:warning: override: reassigning to symbol BR2_PACKAGE_HOST_UBOOT_TOOLS

While we're at it, move the HOST_UBOOT_TOOLS_* options where savedefconfig
would put them.

Signed-off-by: Peter Korsgaard <peter@korsgaard.com>
Signed-off-by: Romain Naour <romain.naour@smile.fr>
(cherry picked from commit 0ba568276a)
Signed-off-by: Peter Korsgaard <peter@korsgaard.com>
2024-06-08 15:51:30 +02:00
Julien Olivain 9592b990d5 support/testing: improve python-magic-wormhole test reliability
The python-magic-wormhole runtime test can randomly fail on slow
runners, see [1].

The issue is that the sending command is started first in background
_without_ redirecting its output to /dev/null. The receiving command
is started after, expecting the message to be printed on the first
standard output line. On slower systems, the sending command still
print messages while the test controller expect output from the
receiving command. The expected string finally appear, but not on the
first line. This makes the test fail.

This commit fixes the issue by redirecting all outputs (stdout, stderr)
of the sending command to /dev/null. To help even more, the sleep time
is moved from the emulator to the test controller. The sleep time is
also multiplied by the timeout_multiplier.

Fixes: [1]

[1] https://gitlab.com/buildroot.org/buildroot/-/jobs/6888691508

Signed-off-by: Julien Olivain <ju.o@free.fr>
Signed-off-by: Romain Naour <romain.naour@smile.fr>
(cherry picked from commit 9a734700d7)
Signed-off-by: Peter Korsgaard <peter@korsgaard.com>
2024-06-08 15:50:17 +02:00
Romain Naour 8f1371bb31 package/python-ml-dtypes: remove python-pybind from C++ dependency comment
python-pybind dependency has been removed since the version bump to
0.3.2 [1]

[1] 06e1a3620e

Signed-off-by: Romain Naour <romain.naour@smile.fr>
(cherry picked from commit 6ea7784c94)
Signed-off-by: Peter Korsgaard <peter@korsgaard.com>
2024-06-08 15:46:50 +02:00
Fabrice Fontaine 5f36e64944 package/ivi-homescreen: needs gcc >= 8
ivi-homescreen needs C++17 filesystem resulting in the following build
failure with gcc < 8 since its addition in commit
9d8497e79d:

In file included from /home/buildroot/instance-0/output-1/build/ivi-homescreen-5ab78a19e95c88cc5d6b173ab1260a211e78cf0a/third_party/flutter/shell/platform/common/path_utils.cc:5:0:
/home/buildroot/instance-0/output-1/build/ivi-homescreen-5ab78a19e95c88cc5d6b173ab1260a211e78cf0a/third_party/./flutter/shell/platform/common/path_utils.h:8:10: fatal error: filesystem: No such file or directory
 #include <filesystem>
          ^~~~~~~~~~~~

Fixes: 9d8497e79d
 - http://autobuild.buildroot.org/results/a5e88d5a4264a6165be31a99f1c123af53fa382e

Signed-off-by: Fabrice Fontaine <fontaine.fabrice@gmail.com>
Signed-off-by: Yann E. MORIN <yann.morin.1998@free.fr>
(cherry picked from commit 898cf04e47)
Signed-off-by: Peter Korsgaard <peter@korsgaard.com>
2024-06-08 15:43:37 +02:00
Fabrice Fontaine 1809ad9ee4 package/ruby: security bump to version 3.3.1
This release includes security fixes:
 - CVE-2024-27282: Arbitrary memory address read vulnerability with
   Regex search
 - CVE-2024-27281: RCE vulnerability with .rdoc_options in RDoc
 - CVE-2024-27280: Buffer overread vulnerability in StringIO

https://www.ruby-lang.org/en/news/2024/04/23/ruby-3-3-1-released/

Signed-off-by: Fabrice Fontaine <fontaine.fabrice@gmail.com>
Signed-off-by: Yann E. MORIN <yann.morin.1998@free.fr>
(cherry picked from commit a9207e8ccd)
Signed-off-by: Peter Korsgaard <peter@korsgaard.com>
2024-06-08 15:42:14 +02:00
Fabrice Fontaine dbe045d016 package/gr-osmosdr: fix python build
Fix the following python build failure:

In file included from /home/buildroot/instance-0/output-1/host/include/python3.11/Python.h:38,
                 from /home/buildroot/instance-0/output-1/host/arc-buildroot-linux-gnu/sysroot/usr/include/pybind11/detail/common.h:266,
                 from /home/buildroot/instance-0/output-1/host/arc-buildroot-linux-gnu/sysroot/usr/include/pybind11/attr.h:13,
                 from /home/buildroot/instance-0/output-1/host/arc-buildroot-linux-gnu/sysroot/usr/include/pybind11/detail/class.h:12,
                 from /home/buildroot/instance-0/output-1/host/arc-buildroot-linux-gnu/sysroot/usr/include/pybind11/pybind11.h:13,
                 from /home/buildroot/instance-0/output-1/build/gr-osmosdr-0.2.4/python/bindings/device_python.cc:1:
/home/buildroot/instance-0/output-1/host/include/python3.11/pyport.h:596:2: error: #error "LONG_BIT definition appears wrong for platform (bad gcc/glibc config?)."
  596 | #error "LONG_BIT definition appears wrong for platform (bad gcc/glibc config?)."
      |  ^~~~~

Fixes:
 - http://autobuild.buildroot.org/results/f009958c37902a224512b336fcb431903bdd0b96

Signed-off-by: Fabrice Fontaine <fontaine.fabrice@gmail.com>
Signed-off-by: Yann E. MORIN <yann.morin.1998@free.fr>
(cherry picked from commit 8759d81b00)
Signed-off-by: Peter Korsgaard <peter@korsgaard.com>
2024-06-08 15:40:08 +02:00
Jarkko Sakkinen 4424203ae5 package/quota: Update DEVELOPERS address
Signed-off-by: Jarkko Sakkinen <jarkko@kernel.org>
Signed-off-by: Yann E. MORIN <yann.morin.1998@free.fr>
(cherry picked from commit 51fe7536c0)
Signed-off-by: Peter Korsgaard <peter@korsgaard.com>
2024-06-08 15:38:16 +02:00
Peter Korsgaard 141e2aa770 package/procps-ng/S02sysctl: pass SYSCTL_ARGS before -p argument for busybox
The busybox sysctl applet expects all arguments after -p to be filenames to
read:

sysctl -p file -h
sysctl: -h: No such file or directory

VS:

sysctl -h -p file
sysctl: invalid option -- 'h'
BusyBox v1.36.1 (2024-05-17 15:27:21 CEST) multi-call binary.

Usage: sysctl [-enq] { -a | -p [FILE]... | [-w] [KEY[=VALUE]]... }

Show/set kernel parameters

        -e      Don't warn about unknown keys
        -n      Don't show key names
        -q      Quiet
        -a      Show all values
        -p      Set values from FILEs (default /etc/sysctl.conf)
        -w      Set values

This seems to be the intented behaviour:
https://git.busybox.net/busybox/tree/procps/sysctl.c#n317

Notice: The procps-ng variant is happy with both:

sysctl -p file -h

Usage:
 sysctl [options] [variable[=value] ...]

VS:

sysctl -h -p file

Usage:
 sysctl [options] [variable[=value] ...]

So pass SYSCTL_ARGS before the -p args so custom sysctl arguments can be
passed.

Signed-off-by: Peter Korsgaard <peter@korsgaard.com>
Signed-off-by: Yann E. MORIN <yann.morin.1998@free.fr>
(cherry picked from commit 60b02eb6c6)
Signed-off-by: Peter Korsgaard <peter@korsgaard.com>
2024-06-08 15:07:52 +02:00
Peter Korsgaard 862aeb7830 package/libvncserver: correct WITH_THREADS=ON/OFF logic
Commit ee59023794 (package/libvncserver: bump to version 0.9.12)
changes the package from autotools to cmake and accidently inverted the
threads logic.

The reason this was not noticed is that the build system verifies if threads
support works and otherwise disables it even when -DWITH_THREADS=ON is
passed, E.G.  for a nothread configuration:

cmake ... -DWITH_THREADS=ON ...
..
-- Performing Test CMAKE_HAVE_LIBC_PTHREAD
-- Performing Test CMAKE_HAVE_LIBC_PTHREAD - Failed
-- Looking for pthread_create in pthreads
-- Looking for pthread_create in pthreads - not found
-- Looking for pthread_create in pthread
-- Looking for pthread_create in pthread - not found

Signed-off-by: Peter Korsgaard <peter@korsgaard.com>
Signed-off-by: Yann E. MORIN <yann.morin.1998@free.fr>
(cherry picked from commit 7b3c0b19d4)
Signed-off-by: Peter Korsgaard <peter@korsgaard.com>
2024-06-08 15:07:22 +02:00
Peter Korsgaard 46871affea package/ruby: build host-ruby with yaml support
webkitgtk/wpewebkit needs a host-ruby with yaml support, otherwise the build
fails with errors like:

cd /home/peko/source/buildroot/output/build/webkitgtk-2.42.2/Source/WebCore && \
  /home/peko/source/buildroot/output/host/bin/ruby \
    /home/peko/source/buildroot/output/build/webkitgtk-2.42.2/Source/WebCore/Scripts/GenerateSettings.rb \
    --outputDir /home/peko/source/buildroot/output/build/webkitgtk-2.42.2/WebCore/DerivedSources \
    --template /home/peko/source/buildroot/output/build/webkitgtk-2.42.2/Source/WebCore/Scripts/SettingsTemplates/InternalSettingsGenerated.cpp.erb \
    --template /home/peko/source/buildroot/output/build/webkitgtk-2.42.2/Source/WebCore/Scripts/SettingsTemplates/InternalSettingsGenerated.idl.erb \
    --template /home/peko/source/buildroot/output/build/webkitgtk-2.42.2/Source/WebCore/Scripts/SettingsTemplates/InternalSettingsGenerated.h.erb \
    --template /home/peko/source/buildroot/output/build/webkitgtk-2.42.2/Source/WebCore/Scripts/SettingsTemplates/Settings.cpp.erb \
    --template /home/peko/source/buildroot/output/build/webkitgtk-2.42.2/Source/WebCore/Scripts/SettingsTemplates/Settings.h.erb \
    /home/peko/source/buildroot/output/build/webkitgtk-2.42.2/WTF/Scripts/Preferences/UnifiedWebPreferences.yaml \
    /home/peko/source/buildroot/output/build/webkitgtk-2.42.2/Source/WebCore/page/Settings.yaml
/home/peko/source/buildroot/output/host/lib/ruby/3.3.0/yaml.rb:3: warning: It seems your ruby installation is missing psych (for YAML output).
To eliminate this warning, please install libyaml and reinstall your ruby.

We do not currently have any Config.in.host options for ruby or libyaml, but
given how small/fast libyaml is to build just do it unconditionally.

Signed-off-by: Peter Korsgaard <peter@korsgaard.com>
Signed-off-by: Yann E. MORIN <yann.morin.1998@free.fr>
(cherry picked from commit 95093854e4)
Signed-off-by: Peter Korsgaard <peter@korsgaard.com>
2024-06-08 15:05:14 +02:00
Fabrice Fontaine 491271b4fe package/libnpth: fix gnupg2 build with uclibc
Fix the following build failure of gnupg2 raised since bump to version
1.7 in commit 3ef4d24192 and
https://git.gnupg.org/cgi-bin/gitweb.cgi?p=npth.git;a=commitdiff;h=02ce6b2d27f91ed6285e4e92d99c21bcc7823c9b:

/home/autobuild/autobuild/instance-2/output-1/host/lib/gcc/armeb-buildroot-linux-uclibcgnueabi/13.2.0/../../../../armeb-buildroot-linux-uclibcgnueabi/bin/ld: /home/autobuild/autobuild/instance-2/output-1/host/bin/../armeb-buildroot-linux-uclibcgnueabi/sysroot/usr/lib/libnpth.so: undefined reference to `busy_wait_for'

Fixes: 3ef4d24192
 - http://autobuild.buildroot.org/results/9a27ffde79598a39b4fd55c716978d32d0beb924

Signed-off-by: Fabrice Fontaine <fontaine.fabrice@gmail.com>
Signed-off-by: Peter Korsgaard <peter@korsgaard.com>
(cherry picked from commit ad64ddd4f3)
Signed-off-by: Peter Korsgaard <peter@korsgaard.com>
2024-06-08 15:04:26 +02:00
Fabrice Fontaine 896f3342a6 package/gnuplot: fix readline dependency
--without-readline is interpreted as --with-readline=builtin since bump
to version 5.4.0 in commit 263da09323 and
https://github.com/gnuplot/gnuplot/commit/b492ea63bd604081ffb9dee3843e295b0b29df85
so add a mandatory dependency to readline or libedit to gnuplot

As a side-effect, this will avoid the following build failure with
builtin readline raised since bump to version 6.0.0 in commit
5f11ce4aea:

/home/autobuild/autobuild/instance-14/output-1/host/lib/gcc/arm-buildroot-linux-gnueabi/13.2.0/../../../../arm-buildroot-linux-gnueabi/bin/ld: history.o: in function `read_history':
history.c:(.text+0xa8): undefined reference to `gp_read_history'

Fixes: 5f11ce4aea
 - http://autobuild.buildroot.org/results/5e45dd8f9071694110c8481f222b9b07b6a97ef3

Signed-off-by: Fabrice Fontaine <fontaine.fabrice@gmail.com>
Signed-off-by: Peter Korsgaard <peter@korsgaard.com>
(cherry picked from commit 93864cef0b)
Signed-off-by: Peter Korsgaard <peter@korsgaard.com>
2024-06-08 15:02:47 +02:00
Bernd Kuhls fdcad34a2a package/squid: security bump version to 6.9
Fixes CVE-2024-25111:
https://github.com/squid-cache/squid/security/advisories/GHSA-72c2-c3wm-8qxc

Signed-off-by: Bernd Kuhls <bernd@kuhls.net>
[Peter: update sha256 hash]
Signed-off-by: Peter Korsgaard <peter@korsgaard.com>
(cherry picked from commit 58ccc55bff)
Signed-off-by: Peter Korsgaard <peter@korsgaard.com>
2024-06-08 15:02:09 +02:00
Bernd Kuhls d0bdeb09ac package/{mesa3d, mesa3d-headers}: bump version to 24.0.7
Release notes:
https://lists.freedesktop.org/archives/mesa-announce/2024-May/000758.html

Signed-off-by: Bernd Kuhls <bernd@kuhls.net>
Signed-off-by: Peter Korsgaard <peter@korsgaard.com>
(cherry picked from commit 4b18f32e5d)
Signed-off-by: Peter Korsgaard <peter@korsgaard.com>
2024-06-08 15:01:30 +02:00
Fabrice Fontaine 96ed028f03 package/libedit: set LIBEDIT_CPE_ID_VALID
cpe:2.3:a:libedit_project:libedit is a valid CPE identifier for this
package:

  https://nvd.nist.gov/products/cpe/detail/42ACF08B-DD62-48D3-8568-32DAFD116956

Signed-off-by: Fabrice Fontaine <fontaine.fabrice@gmail.com>
Signed-off-by: Peter Korsgaard <peter@korsgaard.com>
(cherry picked from commit 300cb3dc16)
Signed-off-by: Peter Korsgaard <peter@korsgaard.com>
2024-06-08 15:01:04 +02:00
Fabrice Fontaine 7b3a49aa43 package/cjson: security bump to version 1.7.18
Add NULL check to cJSON_SetValuestring() (CVE-2024-31755)

https://github.com/DaveGamble/cJSON/releases/tag/v1.7.18

Signed-off-by: Fabrice Fontaine <fontaine.fabrice@gmail.com>
Signed-off-by: Peter Korsgaard <peter@korsgaard.com>
(cherry picked from commit 0c091c15ea)
Signed-off-by: Peter Korsgaard <peter@korsgaard.com>
2024-06-08 15:00:13 +02:00
Gaël PORTAY 9da3d9a04f package/musl: enable on s390x
Add s390x musl supported archs. Upstream musl already supports s390x[1].

Tested with qemu_s390s_defconfig:

	$ output/host/bin/qemu-system-s390x -M s390-ccw-virtio -cpu max,zpci=on -m 4G -smp 2 -kernel output/bzImage -drive file=output/images/rootfs.ext2,if=virtio,format=raw -append "rootwait root=/dev/vda net.ifnames=0 biosdevname=0" -display none -serial mon:stdio -net nic,model=virtio -net user
	(...)
	Welcome to Buildroot
	buildroot login: root
	# uname -a
	Linux buildroot 6.1.44 #2 SMP Sun Feb 18 01:33:42 CET 2024 s390x GNU/Linux
	# /lib/ld-musl-s390x.so.1
	musl libc (s390x)
	Version 1.2.4
	Dynamic Program Loader
	Usage: /lib/ld-musl-s390x.so.1 [options] [--] pathname [args]

[1]: https://git.musl-libc.org/cgit/musl/commit/?id=15094943050eb9a564f409323070e50b40f78816

Signed-off-by: Gaël PORTAY <gael.portay@rtone.fr>
Signed-off-by: Thomas Petazzoni <thomas.petazzoni@bootlin.com>
(cherry picked from commit ab990cf58a)
Signed-off-by: Peter Korsgaard <peter@korsgaard.com>
2024-06-08 13:53:09 +02:00
Bernd Kuhls ab0d9104e9 {linux, linux-headers}: bump 4.19.x / 5.{4, 10, 15}.x / 6.{1, 6, 8}.x series
Signed-off-by: Bernd Kuhls <bernd@kuhls.net>
Signed-off-by: Thomas Petazzoni <thomas.petazzoni@bootlin.com>
(cherry picked from commit a28bc67ce5)
[Peter: drop 6.8.x bump]
Signed-off-by: Peter Korsgaard <peter@korsgaard.com>
2024-06-08 13:49:07 +02:00
Waldemar Brodkorb 72b0c440e8 package/qemu: fix typo in help text of BR2_PACKAGE_QEMU_TARGET_RISCV32
33-bit was obviously a typo.

Signed-off-by: Waldemar Brodkorb <wbx@openadk.org>
Signed-off-by: Thomas Petazzoni <thomas.petazzoni@bootlin.com>
(cherry picked from commit e23a44bbcb)
Signed-off-by: Peter Korsgaard <peter@korsgaard.com>
2024-06-08 13:37:51 +02:00
Fabrice Fontaine 6cdbb9ae17 package/duma: set HOST_CFLAGS
Set HOST_CFLAGS to avoid the following build failure raised since bump
to version 2.5.21 in commit af2cd694e3:

/usr/bin/gcc -D_LARGEFILE_SOURCE -D_LARGEFILE64_SOURCE -D_FILE_OFFSET_BITS=64 -mlongcalls -mauto-litpools -O2 -g0   -c createconf.c -o createconf.o
gcc: error: unrecognized command-line option '-mlongcalls'
gcc: error: unrecognized command-line option '-mauto-litpools'

Fixes: af2cd694e3
 - http://autobuild.buildroot.org/results/28be2acc6d58754c7431df81d0b63b30e6af8554

Signed-off-by: Fabrice Fontaine <fontaine.fabrice@gmail.com>
Signed-off-by: Thomas Petazzoni <thomas.petazzoni@bootlin.com>
(cherry picked from commit b8c70f6701)
Signed-off-by: Peter Korsgaard <peter@korsgaard.com>
2024-06-08 13:29:30 +02:00
Joachim Wiberg eeb0abb2e1 package/smcroute: bump to version v2.5.7
Fixes segfault on kernel without IPv6 support.  For details, see
https://github.com/troglobit/smcroute/releases/tag/2.5.7

Signed-off-by: Joachim Wiberg <troglobit@gmail.com>
Signed-off-by: Thomas Petazzoni <thomas.petazzoni@bootlin.com>
(cherry picked from commit 86a5cd42db)
Signed-off-by: Peter Korsgaard <peter@korsgaard.com>
2024-06-08 13:27:07 +02:00
Bernd Kuhls e8345d32e0 package/kodi: explicitly link to libiconv when locales disabled
Fixes build error

/home/wbx/buildroot/output/host/lib/gcc/aarch64-buildroot-linux-uclibc/12.3.0/../../../../aarch64-buildroot-linux-uclibc/bin/ld:
build/utils/utils.a(CharsetConverter.cpp.o): undefined reference to symbol 'libiconv_open'
/home/wbx/buildroot/output/host/lib/gcc/aarch64-buildroot-linux-uclibc/12.3.0/../../../../aarch64-buildroot-linux-uclibc/bin/ld:
/home/wbx/buildroot/output/host/aarch64-buildroot-linux-uclibc/sysroot/usr/lib64/libiconv.so.2:
error adding symbols: DSO missing from command line

reported by Waldemar:
http://lists.busybox.net/pipermail/buildroot/2024-May/690952.html

Reproduced and fixed the build error using this defconfig:

BR2_x86_64=y
BR2_TOOLCHAIN_BUILDROOT_UCLIBC=y
BR2_TOOLCHAIN_BUILDROOT_WCHAR=y
BR2_TOOLCHAIN_BUILDROOT_CXX=y
BR2_PER_PACKAGE_DIRECTORIES=y
BR2_ROOTFS_DEVICE_CREATION_DYNAMIC_EUDEV=y
BR2_PACKAGE_KODI=y
BR2_PACKAGE_MESA3D=y
BR2_PACKAGE_MESA3D_GALLIUM_DRIVER_IRIS=y
BR2_PACKAGE_MESA3D_OPENGL_EGL=y
BR2_PACKAGE_MESA3D_OPENGL_ES=y
BR2_PACKAGE_PYTHON3=y
BR2_PACKAGE_PYTHON3_PY_ONLY=y

Reported-by: Waldemar Brodkorb <wbx@openadk.org>
Signed-off-by: Bernd Kuhls <bernd@kuhls.net>
[yann.morin.1998@free.fr: implement it similarly to KODI_C_FLAGS]
Signed-off-by: Yann E. MORIN <yann.morin.1998@free.fr>
(cherry picked from commit f147e3b16a)
Signed-off-by: Peter Korsgaard <peter@korsgaard.com>
2024-06-08 13:24:53 +02:00
Bernd Kuhls 885a2a4667 package/kodi: remove libatomic from linker flags
Kodi added detection for atomic/libatomic with commit
https://github.com/xbmc/xbmc/commit/1673f476b802da1da942cef256cae6272fdf9a4b
so we can remove our own code to handle the dependency.

Signed-off-by: Bernd Kuhls <bernd@kuhls.net>
Signed-off-by: Yann E. MORIN <yann.morin.1998@free.fr>
(cherry picked from commit 31e7ca6026)
Signed-off-by: Peter Korsgaard <peter@korsgaard.com>
2024-06-08 13:24:47 +02:00
Леонид Юрьев (Leonid Yuriev) 5f092f70e7 package/libmdbx: bump version to 0.12.10
This is bugfix release of stable libmdbx branch.

The most significant fixes since v0.12.8 (previous version pinned to
buildroot):

  - Fixed an major bug inherited from LMDB (Lightning Memory-Mappe
    Database) that causes database corruption during use the
    MDBX_DUPFIXED mode, and that has existed for more than 10 years.

  - Fixed of a false error MDBX_CORRUPTED (-30796) in the scenario of
    working in the mode MDBX_DUPFIXED with odd length of multi-values.

  - Fixed a bug in adjusting the cursors in the case splitting a page by
    adding a new page on the left.

  - Troubleshooting an error when opening a database on a read-only file
    system.

  - A set of C++ API improvements.

The complete ChangeLog:
    https://gitflic.ru/project/erthink/libmdbx/blob?file=ChangeLog.md

Signed-off-by: Леонид Юрьев (Leonid Yuriev) <leo@yuriev.ru>
[yann.morin.1998@free.fr: ammend and reflow the commit log]
Signed-off-by: Yann E. MORIN <yann.morin.1998@free.fr>
(cherry picked from commit aea54eab47)
Signed-off-by: Peter Korsgaard <peter@korsgaard.com>
2024-06-08 13:21:37 +02:00
Jan Čermák abfb30a038 package/linux-firmware: add options for missing Intel b/g/n cards
Add firmware files for missing cards from the 802.11bgn product list
in the Linux Firmware Wiki [1].

So far only Wireless-N 130 and 1030 were supported, which use the
6000G2B microcode.

[1] https://wireless.wiki.kernel.org/en/users/drivers/iwlwifi#supported_devices

Signed-off-by: Jan Čermák <sairon@sairon.cz>
Signed-off-by: Thomas Petazzoni <thomas.petazzoni@bootlin.com>
(cherry picked from commit acce2e3a38)
Signed-off-by: Peter Korsgaard <peter@korsgaard.com>
2024-06-08 13:19:03 +02:00
Jan Čermák 4e04997601 package/nfs-utils: only install fsidd binary and unit file with enabled nfsd
FSID daemon and its systemd unit file both depend on
BR2_PACKAGE_NFS_UTILS_RPC_NFSD but they're now always installed. Remove them
both if BR2_PACKAGE_NFS_UTILS_RPC_NFSD is disabled.

Reviewed-by: Giulio Benetti <giulio.benetti@benettiengineering.com>
Signed-off-by: Jan Čermák <sairon@sairon.cz>
Signed-off-by: Thomas Petazzoni <thomas.petazzoni@bootlin.com>
(cherry picked from commit dc3464c4b6)
Signed-off-by: Peter Korsgaard <peter@korsgaard.com>
2024-06-08 13:14:35 +02:00
Fabrice Fontaine a270097247 toolchain/Config.in: update BR2_TOOLCHAIN_HAS_LIBATOMIC dependencies
Update BR2_TOOLCHAIN_HAS_LIBATOMIC dependencies to avoid the following
build failure with libopenssl and
BR2_TOOLCHAIN_EXTERNAL_BOOTLIN_ARMV7M_UCLIBC_STABLE:

/home/buildroot/autobuild/run/instance-2/output-1/host/opt/ext-toolchain/arm-buildroot-uclinux-uclibcgnueabi/bin/ld.real: ./libcrypto.a(libcrypto-lib-threads_pthread.o): in function `CRYPTO_atomic_or':
threads_pthread.c:(.text+0xfa): undefined reference to `__atomic_is_lock_free'

libatomic is available since gcc 4.8, when thread support is enabled.
However, the gcc logic in libatomic/configure.tgt does not recognize
"uclinux" as a valid OS part of the target tuple, and therefore it
does not build libatomic. The "uclinux" part of the tuple is used by
Buildroot when BR2_BINFMT_FLAT=y [1]. This broken logic has only been
fixed for arm since gcc 10.1.0 [2].

Indeed, bootlin armv7m is an uclibc toolchain compiled with atomic
support through libatomic.

[1] https://git.buildroot.net/buildroot/commit/?id=b3d1fb26dcadd8c570e2c415ce05398ecc810b32
[2] https://gcc.gnu.org/git/?p=gcc.git;a=commit;h=b1e21e5a5d19b436f948710e09157c5b3244f541

Fixes:
 - http://autobuild.buildroot.org/results/d25e898f9715bf6a21284807361a57735a7a2e1d
 - http://autobuild.buildroot.org/results/e37ed5ad6ba41d610bffe9c234f699e203ef5069

Signed-off-by: Fabrice Fontaine <fontaine.fabrice@gmail.com>
Signed-off-by: Thomas Petazzoni <thomas.petazzoni@bootlin.com>
(cherry picked from commit 8cb0f6e011)
Signed-off-by: Peter Korsgaard <peter@korsgaard.com>
2024-06-08 13:12:23 +02:00
Stefan Ott 51dc052d1d arch/Config.in.x86: enable SSE2 on Pentium M
The Pentium M does support SSE2 so it would make sense to enable it.

Signed-off-by: Stefan Ott <stefan@ott.net>
Signed-off-by: Thomas Petazzoni <thomas.petazzoni@bootlin.com>
(cherry picked from commit 4c561a7adf)
Signed-off-by: Peter Korsgaard <peter@korsgaard.com>
2024-06-08 13:05:27 +02:00
Martin Böh 10f0d0a742 package/gr-osmosdr: add missing host-python-six dependency to python support
Osmosdr failed to build docs when python support is enabled.
[ 41%] Copying osmosdr docstring templates as pybind headers ...
Traceback (most recent call last):
  File "/home/martb/Schreibtisch/DiscoSAT/satos/output/build/gr-osmosdr-0.2.4/docs/doxygen/update_pydoc.py", line 22, in <module>
    from doxyxml import DoxyIndex, DoxyClass, DoxyFriend, DoxyFunction, DoxyFile
  File "/home/martb/Schreibtisch/DiscoSAT/satos/output/build/gr-osmosdr-0.2.4/docs/doxygen/doxyxml/__init__.py", line 69, in <module>
    from .doxyindex import DoxyIndex, DoxyFunction, DoxyParam, DoxyClass, DoxyFile, DoxyNamespace, DoxyGroup, DoxyFriend, DoxyOther
  File "/home/martb/Schreibtisch/DiscoSAT/satos/output/build/gr-osmosdr-0.2.4/docs/doxygen/doxyxml/doxyindex.py", line 31, in <module>
    from .generated import index
  File "/home/martb/Schreibtisch/DiscoSAT/satos/output/build/gr-osmosdr-0.2.4/docs/doxygen/doxyxml/generated/index.py", line 13, in <module>
    from . import compound
  File "/home/martb/Schreibtisch/DiscoSAT/satos/output/build/gr-osmosdr-0.2.4/docs/doxygen/doxyxml/generated/compound.py", line 15, in <module>
    from . import compoundsuper as supermod
  File "/home/martb/Schreibtisch/DiscoSAT/satos/output/build/gr-osmosdr-0.2.4/docs/doxygen/doxyxml/generated/compoundsuper.py", line 15, in <module>
    import six
ModuleNotFoundError: No module named 'six'
make[2]: *** [python/bindings/CMakeFiles/osmosdr_docstrings.dir/build.make:73: python/bindings/docstring_status] Fehler 1
make[1]: *** [CMakeFiles/Makefile2:332: python/bindings/CMakeFiles/osmosdr_docstrings.dir/all] Fehler 2

Fixes:

  http://autobuild.buildroot.net/results/b60e339e52fbc7ed7607a94381aaab6ec64b7a99/

Signed-off-by: Martin Böh <contact@martb.dev>
Signed-off-by: Thomas Petazzoni <thomas.petazzoni@bootlin.com>
(cherry picked from commit cfda1f0b87)
Signed-off-by: Peter Korsgaard <peter@korsgaard.com>
2024-06-08 12:56:02 +02:00
Fabrice Fontaine 38b224d602 package/dmraid: set -fPIC
Add -fPIC to CFLAGS to fix the following build failure raised since
commit de6415ad9c:

/home/autobuild/autobuild/instance-5/output-1/host/lib/gcc/x86_64-buildroot-linux-gnu/12.3.0/../../../../x86_64-buildroot-linux-gnu/bin/ld: misc/misc.o: warning: relocation against `stdout@@GLIBC_2.2.5' in read-only section `.text'
/home/autobuild/autobuild/instance-5/output-1/host/lib/gcc/x86_64-buildroot-linux-gnu/12.3.0/../../../../x86_64-buildroot-linux-gnu/bin/ld: log/log.o: relocation R_X86_64_PC32 against symbol `stdout@@GLIBC_2.2.5' can not be used when making a shared object; recompile with -fPIC

Fixes: de6415ad9c
 - http://autobuild.buildroot.org/results/0349c6bfd66f5e50429e4a5cc07fb7abf2b07345

Signed-off-by: Fabrice Fontaine <fontaine.fabrice@gmail.com>
Signed-off-by: Thomas Petazzoni <thomas.petazzoni@bootlin.com>
(cherry picked from commit 880066bad6)
Signed-off-by: Peter Korsgaard <peter@korsgaard.com>
2024-06-08 10:15:07 +02:00
Dario Binacchi 21d6995115 package/sscep: fix linking error with musl-libc
The patch fixes the following linking failure:

/home/buildroot/instance-0/output-1/host/opt/ext-toolchain/bin/../lib/gcc/i586-buildroot-linux-musl/9.3.0/../../../../i586-buildroot-linux-musl/bin/ld: /home/buildroot/instance-0/output-1/host/i586-buildroot-linux-musl/sysroot/lib/libc.a(getopt.o): in function `getopt':
getopt.c:(.text.getopt+0x0): multiple definition of `getopt'; src/getopt.o:getopt.c:(.text+0x0): first defined here
/home/buildroot/instance-0/output-1/host/opt/ext-toolchain/bin/../lib/gcc/i586-buildroot-linux-musl/9.3.0/../../../../i586-buildroot-linux-musl/bin/ld: /home/buildroot/instance-0/output-1/host/i586-buildroot-linux-musl/sysroot/lib/libc.a(getopt.o):(.data.optind+0x0): multiple definition of `optind'; src/getopt.o:(.data+0x0): first defined here

Fixes:
- http://autobuild.buildroot.net/results/d5b1b4e5e9d9c8eca5e75c345db4d1f3f0cd84ed

Signed-off-by: Dario Binacchi <dario.binacchi@amarulasolutions.com>
Signed-off-by: Thomas Petazzoni <thomas.petazzoni@bootlin.com>
(cherry picked from commit 5a7c40bd1c)
Signed-off-by: Peter Korsgaard <peter@korsgaard.com>
2024-06-08 10:12:05 +02:00
Thomas Petazzoni 7d89442eee docs/website/index.html: refer to Gitlab and lore
Our index.html page still points to git.buildroot.net as the Git
repository, and to the defunct gmane for the mailing list
activity. Fix these by pointing to Gitlab and lore respectively.

Signed-off-by: Thomas Petazzoni <thomas.petazzoni@bootlin.com>
(cherry picked from commit 3e3bcd6338)
Signed-off-by: Peter Korsgaard <peter@korsgaard.com>
2024-06-08 10:10:57 +02:00
Flávio Tapajós bacb1c67ec configs/asus_tinker-s_rk3288: bump kernel to 6.1.79
latest kernel LTS (6.6.x) is facing problems with the sdcard

Signed-off-by: Flávio Tapajós <flavio.tapajos@newtesc.com.br>
Signed-off-by: Thomas Petazzoni <thomas.petazzoni@bootlin.com>
(cherry picked from commit 3bf6ec888b)
Signed-off-by: Peter Korsgaard <peter@korsgaard.com>
2024-06-08 09:50:20 +02:00
James Hilliard 355accc33a package/swupdate: bump to version 2023.12.1
Signed-off-by: James Hilliard <james.hilliard1@gmail.com>
Reviewed-by: Giulio Benetti <giulio.benetti@benettiengineering.com>
Signed-off-by: Thomas Petazzoni <thomas.petazzoni@bootlin.com>
(cherry picked from commit dfb6b104ea)
Signed-off-by: Peter Korsgaard <peter@korsgaard.com>
2024-06-08 09:46:04 +02:00
Brandon Maier 85ba6c5c09 package/gcc: add patch to fix gcc 11 build warning
When building GCC 11 with GCC 14 the following error occurs

> ../../../libiberty/simple-object-mach-o.c:1231:17: error: passing argument 1 of 'set_32' from incompatible pointer type [-Wincompatible-pointer-types]

This was fixed upstream in GCC12[1]. It is applied to the GCC 11 release
branch[2], but has not been officially released yet.

[1] https://gcc.gnu.org/git/?p=gcc.git;a=commit;h=38757aa88735ab2e511bc428e2407a5a5e9fa0be
[2] https://gcc.gnu.org/git/?p=gcc.git;a=commit;h=02cd761eb1198df50453b2e39653f48053609ffc

Signed-off-by: Brandon Maier <brandon.maier@collins.com>
Signed-off-by: Thomas Petazzoni <thomas.petazzoni@bootlin.com>
(cherry picked from commit 8fa9ad7e4f)
Signed-off-by: Peter Korsgaard <peter@korsgaard.com>
2024-06-08 09:44:35 +02:00
Brandon Maier 3326cbd2e5 package/zip: fix build with GCC 14
Builds with GCC 14 print the following error

> zip.h:726:10: error: conflicting types for 'memset'; have 'char *(char *, int,  unsigned int)'

This is because with GCC 14, Zip incorrectly detects that the memset functions
exist. Which enables the ZMEM flag and declares its own version of memset.

This is because the ./unix/configure script attempts to compile a C file using
'memset' but it does not include the <string.h>. This was allowed in gnu89, but
in GCC 14 -Werror=implicit-function-declaration is enabled by default[1].

We forcefully set '-std=gnu89' so that Zip will compile everything against
gnu89, which suppresses the warning.

[1] https://gcc.gnu.org/gcc-14/porting_to.html#warnings-as-errors

Signed-off-by: Brandon Maier <brandon.maier@collins.com>
Signed-off-by: Thomas Petazzoni <thomas.petazzoni@bootlin.com>
(cherry picked from commit 29c6fe13d3)
Signed-off-by: Peter Korsgaard <peter@korsgaard.com>
2024-06-08 09:43:30 +02:00
Brandon Maier 188d0e5f6f support/testing: add zip test
Signed-off-by: Brandon Maier <brandon.maier@collins.com>
Signed-off-by: Thomas Petazzoni <thomas.petazzoni@bootlin.com>
(cherry picked from commit 23ef540288)
Signed-off-by: Peter Korsgaard <peter@korsgaard.com>
2024-06-08 09:28:50 +02:00
Fabrice Fontaine f3248d0b5c package/zxing-cpp: drop opencv and qt dependencies
opencv and qt handling can be dropped since switch to an active fork in
commit 456a739831 as they are only used
when examples are enabled resulting in the following warning:

CMake Warning:
  Manually-specified variables were not used by the project:

    BUILD_DOC
    BUILD_DOCS
    BUILD_EXAMPLE
    BUILD_TEST
    BUILD_TESTING
    BUILD_TESTS
    CMAKE_DISABLE_FIND_PACKAGE_OpenCV
    CMAKE_DISABLE_FIND_PACKAGE_Qt5

While at it, also drop BUILD_EXAMPLES which is already passed by
pkg-cmake.mk

Fixes: 456a739831

Signed-off-by: Fabrice Fontaine <fontaine.fabrice@gmail.com>
Signed-off-by: Thomas Petazzoni <thomas.petazzoni@bootlin.com>
(cherry picked from commit fd64c544d3)
Signed-off-by: Peter Korsgaard <peter@korsgaard.com>
2024-06-08 09:27:09 +02:00
Fabrice Fontaine 976ad4a1c5 package/zxing-cpp: needs threads
threads are mandatory since switch to an active fork in commit
456a739831:

CMake Error at /home/buildroot/autobuild/run/instance-1/output-1/host/share/cmake-3.28/Modules/FindPackageHandleStandardArgs.cmake:230 (message):
  Could NOT find Threads (missing: Threads_FOUND)

Fixes: 456a739831
 - http://autobuild.buildroot.org/results/b600582d9c5407c7324af70d61fa5c1f96d929f6

Signed-off-by: Fabrice Fontaine <fontaine.fabrice@gmail.com>
Signed-off-by: Thomas Petazzoni <thomas.petazzoni@bootlin.com>
(cherry picked from commit 4c40af9838)
Signed-off-by: Peter Korsgaard <peter@korsgaard.com>
2024-06-08 09:26:26 +02:00
Fabrice Fontaine 38abde13aa package/binutils-bare-metal: fix CPE ID
Commit 11b439ce1b forgot to set
HOST_BINUTILS_BARE_METAL_CPE_ID_PRODUCT

Signed-off-by: Fabrice Fontaine <fontaine.fabrice@gmail.com>
Reviewed-by: Neal Frager <neal.frager@amd.com>
Signed-off-by: Thomas Petazzoni <thomas.petazzoni@bootlin.com>
(cherry picked from commit 0daf2fc73d)
Signed-off-by: Peter Korsgaard <peter@korsgaard.com>
2024-06-08 09:22:13 +02:00
Fabrice Fontaine 229d846db0 package/rtl8189fs: bump to latest git commit
Bump to latest git commit to fix the following powerpc64 build failure
raised at least since commit 25956b29e4
thanks to
https://github.com/jwrdegoede/rtl8189ES_linux/commit/c7bf7590bc0d7252005fd0496898ad420a85e1ae:

In file included from /home/autobuild/autobuild/instance-7/output-1/build/rtl8189fs-5d523593f41c0b8d723c6aa86b217ee1d0965786/./include/drv_types.h:30,
                 from /home/autobuild/autobuild/instance-7/output-1/build/rtl8189fs-5d523593f41c0b8d723c6aa86b217ee1d0965786/./core/rtw_cmd.c:17:
/home/autobuild/autobuild/instance-7/output-1/build/rtl8189fs-5d523593f41c0b8d723c6aa86b217ee1d0965786/./include/wifi.h:459:32: error: conflicting types for 'get_ra'; have 'unsigned char *(unsigned char *)'
  459 | __inline static unsigned char *get_ra(unsigned char *pframe)
      |                                ^~~~~~

Fixes: 25956b29e4
 - http://autobuild.buildroot.org/results/83153ed38a583ce2712df9b142ac3fc55a8413e3
 - http://autobuild.buildroot.org/results/63186c7adb5ecc8b8a16a6ae641ecfb9c03478bd

Signed-off-by: Fabrice Fontaine <fontaine.fabrice@gmail.com>
Signed-off-by: Thomas Petazzoni <thomas.petazzoni@bootlin.com>
(cherry picked from commit 0dd00cbce5)
Signed-off-by: Peter Korsgaard <peter@korsgaard.com>
2024-06-08 09:21:31 +02:00
André Zwing fb1b33c040 package/libkrb5: security bump to 1.21.2
Fixes the following security issues:

- CVE-2023-36054: lib/kadm5/kadm_rpc_xdr.c in MIT Kerberos 5 (aka krb5)
  before 1.20.2 and 1.21.x before 1.21.1 frees an uninitialized pointer

- CVE-2023-39975: kdc/do_tgs_req.c in MIT Kerberos 5 (aka krb5) 1.21 before
  1.21.2 has a double free that is reachable if an authenticated user can
  trigger an authorization-data handling failure

Signed-off-by: André Zwing <nerv@dawncrow.de>
Signed-off-by: Thomas Petazzoni <thomas.petazzoni@bootlin.com>
(cherry picked from commit dd1ea28b07)
[Peter: mark as security bump, add CVE details]
Signed-off-by: Peter Korsgaard <peter@korsgaard.com>
2024-06-08 09:18:39 +02:00
Fabrice Fontaine 1669a9efc0 package/redis-plus-plus: bump to version 1.3.12
https://github.com/sewenew/redis-plus-plus/releases/tag/1.3.11
https://github.com/sewenew/redis-plus-plus/releases/tag/1.3.12
https://github.com/sewenew/redis-plus-plus/compare/1.3.10...1.3.12

Signed-off-by: Fabrice Fontaine <fontaine.fabrice@gmail.com>
Signed-off-by: Thomas Petazzoni <thomas.petazzoni@bootlin.com>
(cherry picked from commit ee2a9a5e41)
Signed-off-by: Peter Korsgaard <peter@korsgaard.com>
2024-06-08 09:15:11 +02:00
Fabrice Fontaine 9862d0c271 package/gcc-bare-metal: add CPE variables
cpe:2.3:a:gnu:gcc is a valid CPE identifier for this package:

  https://nvd.nist.gov/products/cpe/detail/A30F1DE7-139B-4296-AA87-A516462A1A81

Signed-off-by: Fabrice Fontaine <fontaine.fabrice@gmail.com>
Reviewed-by: Neal Frager <neal.frager@amd.com>
Signed-off-by: Thomas Petazzoni <thomas.petazzoni@bootlin.com>
(cherry picked from commit fccd228bac)
Signed-off-by: Peter Korsgaard <peter@korsgaard.com>
2024-06-08 09:12:40 +02:00
Fabrice Fontaine e83f6edf43 package/libuhttpd: disable -Werror
Disable -Werror to fix the following build failure raised at least since
bump to version 3.9.0 in commit e76d9868c9
and
https://github.com/zhaojh329/libuhttpd/commit/81db1fa371bc80f40c1bfe60010e7d64bdf30b46:

/home/autobuild/autobuild/instance-8/output-1/build/libuhttpd-3.14.1/src/file.c: In function '__serve_file':
/home/autobuild/autobuild/instance-8/output-1/build/libuhttpd-3.14.1/src/file.c:322:50: error: format '%llu' expects argument of type 'long long unsigned int', but argument 4 has type '__off_t' {aka 'long int'} [-Werror=format=]
  322 |         conn->send_header(conn, "Content-Range", "bytes */%" PRIu64, st->st_size);
      |                                                  ^~~~~~~~~~~         ~~~~~~~~~~~
      |                                                                        |
      |                                                                        __off_t {aka long int}
In file included from /home/autobuild/autobuild/instance-8/output-1/build/libuhttpd-3.14.1/src/file.c:36:
/home/autobuild/autobuild/instance-8/output-1/per-package/libuhttpd/host/mips64el-buildroot-linux-uclibc/sysroot/usr/include/inttypes.h:91:41: note: format string is defined here
   91 | # define PRIu64         __PRI64_PREFIX "u"
cc1: all warnings being treated as errors

Fixes: e76d9868c9
 - http://autobuild.buildroot.org/results/46349a1409f9cff027b462456078284459e75511

Signed-off-by: Fabrice Fontaine <fontaine.fabrice@gmail.com>
Signed-off-by: Thomas Petazzoni <thomas.petazzoni@bootlin.com>
(cherry picked from commit 5961b21918)
Signed-off-by: Peter Korsgaard <peter@korsgaard.com>
2024-06-08 09:10:02 +02:00
Kilian Zinnecker 8364c23d91 configs/rock5b: remove futile unsetting of BR2_LINUX_KERNEL_INTREE_DTS_NAME
The rock5b_defconfig contained a

  # BR2_LINUX_KERNEL_INTREE_DTS_NAME is not set

line. This caused check-dotconfig.py to throw a warning in the
buildroot CI, because the explicit unsetting of the parameter is not
taken on in the actual dotconfig, but instead the dotconfig will
contain the line 'BR2_LINUX_KERNEL_INTREE_DTS_NAME=""'.

This patch removes the parameter from the rock5b_defconfig. The
resulting dotconfig from the original rock5b_defconfig and the
rock5b_defconfig without the parameter is identical, but the
check-dotconfig.py does not throw a warning anymore.

Signed-off-by: Kilian Zinnecker <kilian.zinnecker@mail.de>
Signed-off-by: Thomas Petazzoni <thomas.petazzoni@bootlin.com>
(cherry picked from commit 0f0660ad2d)
Signed-off-by: Peter Korsgaard <peter@korsgaard.com>
2024-06-08 09:08:59 +02:00
Maxim Kochetkov 4e2b690865 package/postgresql: bump version to 16.2
Release notes: https://www.postgresql.org/docs/release/16.2/

The hash of the license file is updated due to a change in copyright
years:

-Portions Copyright (c) 1996-2023, PostgreSQL Global Development Group
+Portions Copyright (c) 1996-2024, PostgreSQL Global Development Group

Signed-off-by: Maxim Kochetkov <fido_max@inbox.ru>
Signed-off-by: Thomas Petazzoni <thomas.petazzoni@bootlin.com>
(cherry picked from commit 360d2da3fa)
Signed-off-by: Peter Korsgaard <peter@korsgaard.com>
2024-06-08 09:07:26 +02:00
Adrian Perez de Castro de7c48ade7 package/libmanette: bump to version 0.2.7
This is a bugfix release which mainly imroves device detection,
specially inside the Flatpak sandbox. Additionally, this version
includes the patch for building as a static library, and the patch
file can be removed.

Release notes:

  https://gitlab.gnome.org/GNOME/libmanette/-/commit/27554bd118c08141134d4147cc34794057eb36e2

Signed-off-by: Adrian Perez de Castro <aperez@igalia.com>
Signed-off-by: Thomas Petazzoni <thomas.petazzoni@bootlin.com>
(cherry picked from commit a4a90ee603)
Signed-off-by: Peter Korsgaard <peter@korsgaard.com>
2024-06-08 09:05:48 +02:00
Adrian Perez de Castro c243e55494 package/cog: bump to version 0.18.3
This is a small bugfix release, with fixes for device scaling handling
(i.e. HiDPI displays), and with support to toggle WebKit runtime
features. Release notes:

  https://wpewebkit.org/release/cog-0.18.3.html

Signed-off-by: Adrian Perez de Castro <aperez@igalia.com>
Signed-off-by: Thomas Petazzoni <thomas.petazzoni@bootlin.com>
(cherry picked from commit e695da731f)
Signed-off-by: Peter Korsgaard <peter@korsgaard.com>
2024-06-08 08:41:42 +02:00
Leo Soares 1781340fa3 package/janus-gateway: add staging installation
Install janus to staging directory so that external plugins can be built.

Signed-off-by: Leo Soares <leojrfs@gmail.com>
Signed-off-by: Thomas Petazzoni <thomas.petazzoni@bootlin.com>
(cherry picked from commit f80b393d45)
Signed-off-by: Peter Korsgaard <peter@korsgaard.com>
2024-06-08 08:38:50 +02:00
Julien Olivain 04b6b4f59c support/testing: add gnuplot runtime test
Signed-off-by: Julien Olivain <ju.o@free.fr>
Signed-off-by: Thomas Petazzoni <thomas.petazzoni@bootlin.com>
(cherry picked from commit 92ae6d75c1)
Signed-off-by: Peter Korsgaard <peter@korsgaard.com>
2024-06-08 08:30:39 +02:00
Bernd Kuhls d50049e60f package/libdrm: fix install of test programs
Buildroot commit f95069814b disabled the
build of test programs unconditionally without considering the option
BR2_PACKAGE_LIBDRM_INSTALL_TESTS.

Signed-off-by: Bernd Kuhls <bernd@kuhls.net>
Signed-off-by: Thomas Petazzoni <thomas.petazzoni@bootlin.com>
(cherry picked from commit 91848e73ae)
Signed-off-by: Peter Korsgaard <peter@korsgaard.com>
2024-06-07 22:28:50 +02:00
Bernd Kuhls 8886594d59 package/{mesa3d, mesa3d-headers}: bump version to 24.0.6
Release notes:
https://lists.freedesktop.org/archives/mesa-announce/2024-April/000754.html
https://lists.freedesktop.org/archives/mesa-announce/2024-April/000755.html

Signed-off-by: Bernd Kuhls <bernd@kuhls.net>
Signed-off-by: Thomas Petazzoni <thomas.petazzoni@bootlin.com>
(cherry picked from commit e1e4237dc7)
Signed-off-by: Peter Korsgaard <peter@korsgaard.com>
2024-06-07 22:25:17 +02:00
Bernd Kuhls 1be26aad93 package/clamav: bump version to 1.0.6
Release notes:
https://blog.clamav.net/2024/04/clamav-131-123-106-patch-versions.html

Signed-off-by: Bernd Kuhls <bernd@kuhls.net>
Signed-off-by: Thomas Petazzoni <thomas.petazzoni@bootlin.com>
(cherry picked from commit c4f8728e70)
Signed-off-by: Peter Korsgaard <peter@korsgaard.com>
2024-06-07 22:24:39 +02:00
Fabrice Fontaine 3a620c5359 package/mariadb: really use system fmt
Commit 821f9dee81 wrongly used WITH_FMT
instead of WITH_LIBFMT resulting in the following build failure:

[  0%] Creating directories for 'libfmt'
[  0%] Performing download step (download, verify and extract) for 'libfmt'
make[3]: Leaving directory '/home/buildroot/autobuild/run/instance-0/output-1/build/mariadb-10.11.6'
make[3]: Leaving directory '/home/buildroot/autobuild/run/instance-0/output-1/build/mariadb-10.11.6'
-- Downloading...
   dst='/home/buildroot/autobuild/run/instance-0/output-1/build/mariadb-10.11.6/extra/libfmt/src/8.0.1.zip'
   timeout='none'
   inactivity timeout='none'
-- Using src='https://github.com/fmtlib/fmt/archive/refs/tags/8.0.1.zip'
CMake Error at libfmt-stamp/download-libfmt.cmake:170 (message):
  Each download failed!

    error: downloading 'https://github.com/fmtlib/fmt/archive/refs/tags/8.0.1.zip' failed
          status_code: 1
          status_string: "Unsupported protocol"
          log:
          --- LOG BEGIN ---
          Protocol "https" not supported or disabled in libcurl

  Closing connection

          --- LOG END ---

Fixes: 821f9dee81
 - http://autobuild.buildroot.org/results/fbe3bc347a83a810ffbbbff93a45994963712bee

Signed-off-by: Fabrice Fontaine <fontaine.fabrice@gmail.com>
Signed-off-by: Thomas Petazzoni <thomas.petazzoni@bootlin.com>
(cherry picked from commit 2cf2491a23)
Signed-off-by: Peter Korsgaard <peter@korsgaard.com>
2024-06-07 22:22:40 +02:00
Fabrice Fontaine aa9dfe9ae7 package/privoxy: fix build with root
Set GROUP_T when installing configuration files as root to avoid the
following build failure raised since commit
b6816034eb:

/usr/bin/install: missing destination file operand after '/home/buildroot/instance-0/output-1/target/etc'

Fixes: b6816034eb
 - http://autobuild.buildroot.org/results/eb4ccf248c9c5048e9b71058bb0311b1e0763883

Signed-off-by: Fabrice Fontaine <fontaine.fabrice@gmail.com>
Signed-off-by: Thomas Petazzoni <thomas.petazzoni@bootlin.com>
(cherry picked from commit 981d25e5bc)
Signed-off-by: Peter Korsgaard <peter@korsgaard.com>
2024-06-07 22:20:23 +02:00
Yann E. MORIN da56f2dc4c package/luajit: drop useless post-extract hook
Since version 2.1, LuaJIT follows a rolling-release scheme, which means
that any commit is as good as any other; LuaJIT uses the comitter's UNIX
timestamp as its semver patch level. It uses the git-attribute
export-subst for the .relver file that contains the %ct placeholder for
git-archive to expand it.

In c9dcd9e459 (package/luajit: bump to version 41fb94defa8f...), we
switched to such an upstream version. There was some confusion around
the handling of the git-attribute and where/when it is generated, and
the first revision of the patch used the git download method, so had to
use post-extract hooks to do the replacement, but the second iteration
kept retrieving the archive generated by github, which has the
replacement already done, but the post-extract hooks were not dropped
although now useless...

With the current code, it is easy to bump the LuaJit version and forget
to update the timestamp stored in the .relver file, which would override
the value that was generated on the github side.

Since the post-extract hook is useless, drop it.

Signed-off-by: Yann E. MORIN <yann.morin.1998@free.fr>
Cc: Francois Perrad <fperrad@gmail.com>
Cc: Thomas Petazzoni <thomas.petazzoni@bootlin.com>
Signed-off-by: Arnout Vandecappelle <arnout@mind.be>
(cherry picked from commit 1bcb51517c)
Signed-off-by: Peter Korsgaard <peter@korsgaard.com>
2024-06-04 16:37:50 +02:00
Yann E. MORIN 6750207e02 package/am33x-cm3: switch upstream
The upstream host, arago-project.org, has vanished, bringing down the
git repository with it.

Switch to another, github-hosted repository, that has the commit we're
interested in.

Signed-off-by: Yann E. MORIN <yann.morin.1998@free.fr>
Signed-off-by: Arnout Vandecappelle <arnout@mind.be>
(cherry picked from commit b1977d933b)
Signed-off-by: Peter Korsgaard <peter@korsgaard.com>
2024-06-04 16:33:35 +02:00
Yann E. MORIN 2fcec25f6a package/docker-compose: bump version
The current version of docker-compose is un-vendorable, because the
dependencies it referenmces (directly or indirectly) are not available:

go: github.com/docker/compose/v2/cmd/compose imports
        github.com/moby/buildkit/util/progress/progressui:
        github.com/crazy-max/buildkit@v0.7.1-0.20240130133234-d9aa289bd124:
        invalid version: unknown revision d9aa289bd124

And indeed, that commit does not exist in that repository. The v0.7.1
tag does exist, but there is not commit that matches the short hash
d9aa289bd124, or even the whole version string. Sigh...

There is no way anyone can vendor the version we currently package, and
all they and us can hope for is that we never lose s.b.o ever.

Bump the version. That one can be vendored. Well, at least it can
_still_ be vendored _now_...

Signed-off-by: Yann E. MORIN <yann.morin.1998@free.fr>
Signed-off-by: Arnout Vandecappelle <arnout@mind.be>
(cherry picked from commit 1b189f5491)
Signed-off-by: Peter Korsgaard <peter@korsgaard.com>
2024-06-04 16:28:16 +02:00
Thomas Petazzoni 4816c095d8 package/pkg-generic.mk: really make DL_SUBDIR inheritance work
While bumping kodi, we figured out that the kodi-texturepacker and
kodi-jsonschemabuilder were both re-downloading the main Kodi tarball,
even though they contain:

KODI_JSONSCHEMABUILDER_DL_SUBDIR = kodi
KODI_TEXTUREPACKER_DL_SUBDIR = kodi

Both are host packages, and turns out that changing those variables to
HOST_ ones made the download sharing work.

Commit efa7712b09 ("package/pkg-generic:
host variant inherits target download settings") introduced
inheritance of host variables from target variables from a number of
variables, including DL_SUBDIR. But it missed the fact that earlier in
pkg-generic.mk, the following line was defined:

  $(2)_DL_SUBDIR ?= $$($(2)_RAWNAME)

So, when this later code kicked in:

 ifndef $(2)_DL_SUBDIR
  ifdef $(3)_DL_SUBDIR
   $(2)_DL_SUBDIR = $$($(3)_DL_SUBDIR)
  endif
 endif

In fact it never did anything because $(2)_DL_SUBDIR would never be
undefined. This commit fixes this issue by properly adjusting the
logic to inherit the value of the target variable when it exists, or
defaulting to $$($(2)_RAWNAME) otherwise.

Cc: Yann E. MORIN <yann.morin.1998@free.fr>
Signed-off-by: Thomas Petazzoni <thomas.petazzoni@bootlin.com>
Signed-off-by: Yann E. MORIN <yann.morin.1998@free.fr>
(cherry picked from commit a1c4d6c884)
Signed-off-by: Peter Korsgaard <peter@korsgaard.com>
2024-06-03 20:07:20 +02:00
Thomas Petazzoni 89492fe1a8 package/hidapi: fixup Config.in comment
The Config.in comment was mentioning both "NPTL" and "threads" as
dependencies, while mentioning only the former is sufficient.

Signed-off-by: Thomas Petazzoni <thomas.petazzoni@bootlin.com>
(cherry picked from commit dabd983c0d)
Signed-off-by: Peter Korsgaard <peter@korsgaard.com>
2024-06-03 19:33:34 +02:00
Julien Olivain 1e70541c85 support/testing: add zbar runtime test
Signed-off-by: Julien Olivain <ju.o@free.fr>
Signed-off-by: Thomas Petazzoni <thomas.petazzoni@bootlin.com>
(cherry picked from commit 85f0941532)
Signed-off-by: Peter Korsgaard <peter@korsgaard.com>
2024-06-03 18:06:23 +02:00
Julien Olivain fe189deeed package/zbar: add the optional imagemagick dependency
When ImageMagick is selected, the "zbarimg" program is compiled and
installed on target. It allows to decode a QR code from an image file.

Signed-off-by: Julien Olivain <ju.o@free.fr>
Signed-off-by: Thomas Petazzoni <thomas.petazzoni@bootlin.com>
(cherry picked from commit 84ad5c22d0)
Signed-off-by: Peter Korsgaard <peter@korsgaard.com>
2024-06-03 18:06:18 +02:00
Thomas Petazzoni 5dcf2d8849 package/ivi-homescreen: drop bogus comment dependency on NPTL
As part of the review process of the ivi-homescreen package, which
landed in commit 9d8497e79d, it was
deemed that the dependency on BR2_TOOLCHBAIN_HAS_THREAD_NPTL was not
needed, as it was implied by glibc. According to the commit log:

    [yann.morin.1998@free.fr:
      - propagate BR2_PACKAGE_HOST_FLUTTER_SDK_BIN_ARCH_SUPPORTS to comments
      - drop NPTL, implied by glibc
      - reorder dependencies in a more logical way
      - reorder comments
      - drop undefined BR2_PACKAGE_IVI_HOMESCREEN_HAS_CLIENT
      - grammar ("for to change")
    ]
    Signed-off-by: Yann E. MORIN <yann.morin.1998@free.fr>

However, while the BR2_TOOLCHBAIN_HAS_THREAD_NPTL dependency was
removed from the BR2_PACKAGE_IVI_HOMESCREEN option definition, the
corresponding dependency in the Config.in comment was not
dropped. Let's bring things back in sync.

Signed-off-by: Thomas Petazzoni <thomas.petazzoni@bootlin.com>
(cherry picked from commit b9b072f83c)
Signed-off-by: Peter Korsgaard <peter@korsgaard.com>
2024-06-03 18:00:23 +02:00
Paul Cercueil 923ab8a7d5 package/lightning: bump version to 2.2.3
Release notes:
https://lists.gnu.org/archive/html/lightning/2024-02/msg00000.html

Signed-off-by: Paul Cercueil <paul@crapouillou.net>
Signed-off-by: Thomas Petazzoni <thomas.petazzoni@bootlin.com>
(cherry picked from commit c89bec21db)
Signed-off-by: Peter Korsgaard <peter@korsgaard.com>
2024-06-03 17:55:33 +02:00
Ludovic Desroches 3bababa87b package/evemu: add staging installation
To make the evdev library available for other packages, install it to the
staging directory.

Signed-off-by: Ludovic Desroches <ludovic.desroches@microchip.com>
Signed-off-by: Thomas Petazzoni <thomas.petazzoni@bootlin.com>
(cherry picked from commit a9e54f2cdf)
Signed-off-by: Peter Korsgaard <peter@korsgaard.com>
2024-06-03 17:54:10 +02:00
Chen Pei 5751191f2d package/bpftool: enable on riscv
bpftool supports RISC-V, including rv64 and rv32, so let's enable the
bpftool package on RISC-V.

Signed-off-by: Chen Pei <cp0613@linux.alibaba.com>
Signed-off-by: Thomas Petazzoni <thomas.petazzoni@bootlin.com>
(cherry picked from commit a91a245ec0)
Signed-off-by: Peter Korsgaard <peter@korsgaard.com>
2024-06-03 17:53:08 +02:00
Julien Olivain bf952b0cb7 support/config-fragments: fix bootlin-x86-i686-musl
Commit a8be4a04ad "support/config-fragments: replace
br-i386-pentium-mmx-musl" replaced this old toolchain by
bootlin-x86-i686-musl.

When using test-pkg with all toolchains, bootlin-x86-i686-musl is always
failing. The issue can be reproduced with for example:

    utils/test-pkg -a -p busybox

The issue can also be reproduced with a simple config like:

    cat > .config <<EOF
    BR2_i386=y
    BR2_TOOLCHAIN_EXTERNAL=y
    BR2_TOOLCHAIN_EXTERNAL_BOOTLIN=y
    BR2_TOOLCHAIN_EXTERNAL_BOOTLIN_X86_I686_MUSL_STABLE=y
    BR2_PACKAGE_BUSYBOX=y
    EOF
    make olddefconfig
    make

Compilation fail with output:

    Cannot execute cross-compiler '/i586-linux-gcc'

This issue happen is because the toolchain can never be selected.

The config fragment [1] selects BR2_i386 alone.

The target architecture variant default to i586 if target
architecture is i386. See [2].

Finally, the generated toolchain options includes a depends on
BR2_i386 and !BR2_x86_i586, making the toolchain always ignored.
See [3].

This commit fixes the issue by adding BR2_x86_i686=y to the
bootlin-x86-i686-musl.config fragment as suggested by the
Bootlin toolchain fragment [4].

[1] https://gitlab.com/buildroot.org/buildroot/-/blob/a8be4a04ade8e695c5c4d4a825253d69e80693f9/support/config-fragments/autobuild/bootlin-x86-i686-musl.config
[2] https://gitlab.com/buildroot.org/buildroot/-/blob/2024.02.2/arch/Config.in.x86?ref_type=tags#L38
[3] https://gitlab.com/buildroot.org/buildroot/-/blob/345ccb523e/toolchain/toolchain-external/toolchain-external-bootlin/Config.in.options#L5768-5770
[4] https://toolchains.bootlin.com/downloads/releases/toolchains/x86-i686/fragments/x86-i686--musl--stable-2024.02-1.frag

Signed-off-by: Julien Olivain <ju.o@free.fr>
[Romain: add the link to the Bootlin toolchain fragment]
Signed-off-by: Romain Naour <romain.naour@smile.fr>
(cherry picked from commit 1263adf7a9)
Signed-off-by: Peter Korsgaard <peter@korsgaard.com>
2024-06-03 17:52:06 +02:00
Fabrice Fontaine 30cb9d9f90 support/config-fragments: replace br-i386-pentium-mmx-musl
Replace br-i386-pentium-mmx-musl by bootlin-x86-i686-musl to avoid the
following build failure with efivar and musl < 1.2.3 as suggested in
https://patchwork.ozlabs.org/project/buildroot/patch/20240303171115.1140763-1-ju.o@free.fr:

/home/buildroot/instance-0/output-1/host/opt/ext-toolchain/bin/../lib/gcc/i586-buildroot-linux-musl/9.3.0/../../../../i586-buildroot-linux-musl/bin/ld: ./libefisec.so: undefined reference to `qsort_r'

Fixes:
 - http://autobuild.buildroot.org/results/a0ed3970da8a84d884b26c081b49b8d2b7208829

Signed-off-by: Fabrice Fontaine <fontaine.fabrice@gmail.com>
Signed-off-by: Thomas Petazzoni <thomas.petazzoni@bootlin.com>
(cherry picked from commit a8be4a04ad)
Signed-off-by: Peter Korsgaard <peter@korsgaard.com>
2024-06-03 17:49:43 +02:00
Julien Olivain c796ab743a package/imagemagick: bump to version 7.1.1-31
For change log, see [1].

License hash file changed, due to the addition of an URL. See [2].

Fixes: [3]

Some 32 bit architectures were failing at runtime with the message:

    FATAL: time limit exceeded 'file.png' @ fatal/cache.c/GetImagePixelCache/1702

The fix is included in 7.1.1-23.

[1] https://github.com/ImageMagick/Website/blob/main/ChangeLog.md
[2] https://github.com/ImageMagick/ImageMagick/commit/2c87d7da1b1db4573a37bd7933dfbf772ac3eecf
[3] https://github.com/ImageMagick/ImageMagick/issues/6891

Signed-off-by: Julien Olivain <ju.o@free.fr>
Signed-off-by: Thomas Petazzoni <thomas.petazzoni@bootlin.com>
(cherry picked from commit 0c9ea82ea8)
Signed-off-by: Peter Korsgaard <peter@korsgaard.com>
2024-06-03 17:47:24 +02:00
Julien Olivain 079b471563 support/testing: add socat runtime test
Signed-off-by: Julien Olivain <ju.o@free.fr>
Signed-off-by: Thomas Petazzoni <thomas.petazzoni@bootlin.com>
(cherry picked from commit b1bbc7ac6e)
Signed-off-by: Peter Korsgaard <peter@korsgaard.com>
2024-06-03 17:32:48 +02:00
Julien Olivain 59a0b5c9fd support/testing: add lrzsz runtime test
Signed-off-by: Julien Olivain <ju.o@free.fr>
Signed-off-by: Thomas Petazzoni <thomas.petazzoni@bootlin.com>
(cherry picked from commit dd45ac10d9)
Signed-off-by: Peter Korsgaard <peter@korsgaard.com>
2024-06-03 17:26:20 +02:00
Charles Hardin 72ca72c4b9 package/gstreamer1/gst1-plugins-good: add qt5tools as a dependency
The following defconfig:

 BR2_aarch64=y
 BR2_cortex_a72=y
 BR2_TOOLCHAIN_EXTERNAL=y
 BR2_INIT_NONE=y
 BR2_SYSTEM_BIN_SH_NONE=y
 # BR2_PACKAGE_BUSYBOX is not set
 BR2_PACKAGE_GSTREAMER1=y
 BR2_PACKAGE_GST1_PLUGINS_BASE_LIB_OPENGL=y
 BR2_PACKAGE_GST1_PLUGINS_GOOD=y
 # BR2_PACKAGE_GST1_PLUGINS_GOOD_PLUGIN_AVI is not set
 # BR2_PACKAGE_GST1_PLUGINS_GOOD_PLUGIN_ISOMP4 is not set
 # BR2_PACKAGE_GST1_PLUGINS_GOOD_PLUGIN_WAVPARSE is not set
 BR2_PACKAGE_GST1_PLUGINS_GOOD_PLUGIN_QMLGL=y
 BR2_PACKAGE_MESA3D=y
 BR2_PACKAGE_MESA3D_GALLIUM_DRIVER_SWRAST=y
 BR2_PACKAGE_MESA3D_OPENGL_EGL=y
 BR2_PACKAGE_MESA3D_OPENGL_ES=y
 BR2_PACKAGE_QT5=y
 BR2_PACKAGE_WAYLAND=y
 # BR2_TARGET_ROOTFS_TAR is not set

fails to build in gst1-plugins-good, with:

    build/gst1-plugins-good-1.22.9/ext/qt/meson.build:48:4: ERROR: Problem encountered: qt5 qmlglsink plugin is enabled, but qt specific tools were not found

This is due to qt5tools being missing. This commit adds this missing
dependency.

Signed-off-by: Charles Hardin <ckhardin@gmail.com>
Signed-off-by: Thomas Petazzoni <thomas.petazzoni@bootlin.com>
(cherry picked from commit c107dd33e6)
Signed-off-by: Peter Korsgaard <peter@korsgaard.com>
2024-06-03 17:22:52 +02:00
Julien Olivain 107b3cb91c support/testing: lvm2: remove kernel config fragment
The lvm2 package now enables the required Kernel configuration. The
Kernel config fragment included in this test is no longer needed.

This commit removes it.

Signed-off-by: Julien Olivain <ju.o@free.fr>
Signed-off-by: Thomas Petazzoni <thomas.petazzoni@bootlin.com>
(cherry picked from commit 9339343111)
Signed-off-by: Peter Korsgaard <peter@korsgaard.com>
2024-06-03 17:16:20 +02:00
Julien Olivain f1d4de8a73 package/lvm2: enable device-mapper in Kernel config
LVM2 has a hard dependency on the device-mapper presence in the Kernel.
This commit enables those mandatory Kernel configuration by defining
the _LINUX_CONFIG_FIXUPS macro. This will make sure the final system
image will end up in a working configuration.

This was suggested by Arnout in [1].

[1] https://lists.buildroot.org/pipermail/buildroot/2024-April/688776.html

Suggested-by: Arnout Vandecappelle <arnout@mind.be>
Signed-off-by: Julien Olivain <ju.o@free.fr>
Signed-off-by: Thomas Petazzoni <thomas.petazzoni@bootlin.com>
(cherry picked from commit 419d39b261)
Signed-off-by: Peter Korsgaard <peter@korsgaard.com>
2024-06-03 17:15:39 +02:00
Julien Olivain ca30429097 support/testing: add links runtime test
Signed-off-by: Julien Olivain <ju.o@free.fr>
Signed-off-by: Thomas Petazzoni <thomas.petazzoni@bootlin.com>
(cherry picked from commit 449ae81fae)
Signed-off-by: Peter Korsgaard <peter@korsgaard.com>
2024-06-03 12:50:35 +02:00
Bernd Kuhls 6331561b2a package/samba4: bump version to 4.19.6
Release notes: https://www.samba.org/samba/history/samba-4.19.6.html

Signed-off-by: Bernd Kuhls <bernd@kuhls.net>
Signed-off-by: Thomas Petazzoni <thomas.petazzoni@bootlin.com>
(cherry picked from commit e19eb8c29c)
Signed-off-by: Peter Korsgaard <peter@korsgaard.com>
2024-06-03 12:50:18 +02:00
Giulio Benetti 404cbe8a42 package/elfutils: fix host build failure due to missing demangle support
When building on hosts with libstdc++ without demangle support this error
shows up:
checking for __cxa_demangle in -lstdc++... no
configure: error: __cxa_demangle not found in libstdc++, use --disable-demangler to disable demangler support.
make[1]: *** [package/pkg-generic.mk:273: /home/giuliobenetti/br_reproduce/c2524c7580d97f7387ec22da62be71d77f2ed8ec/output/build/host-elfutils-0.189/.stamp_configured] Error 1
make: *** [Makefile:23: _all] Error 2

So let's disable demangler for host by default.

Fixes: still not showed by autobuilders. Reproduced on Ubuntu 22.04 with
Ubuntu APT g++ 11.4.0

Signed-off-by: Giulio Benetti <giulio.benetti@benettiengineering.com>
Reviewed-by: Christian Stewart <christian@aperture.us>
Signed-off-by: Thomas Petazzoni <thomas.petazzoni@bootlin.com>
(cherry picked from commit 5f2c9f882d)
Signed-off-by: Peter Korsgaard <peter@korsgaard.com>
2024-06-03 12:49:59 +02:00
Alexis Lothoré 2e18fd6f07 package/pppd: bump package to fix startup issue
pppd fails to start on a systems with buildroot 2024.02.x because of
missing pppd directory in /var/run. There are some logs hinting at this
issue:
Warning: couldn't open ppp database /var/run/pppd/pppd2.tdb
Can't create lock file /var/run/pppd/lock/LCK..ppp-tty-fifo1: No such file or directory
Can't create lock file /var/run/pppd/lock/LCK..ppp-tty-fifo1: No such file or directory
Can't create lock file /var/run/pppd/lock/LCK..ppp-tty-fifo1: No such file or directory
Can't create lock file /var/run/pppd/lock/LCK..ppp-tty-fifo1: No such file or directory
Can't create lock file /var/run/pppd/lock/LCK..ppp-tty-fifo1: No such file or directory
Can't create lock file /var/run/pppd/lock/LCK..ppp-tty-fifo1: No such file or directory
Can't create lock file /var/run/pppd/lock/LCK..ppp-tty-fifo1: No such file or directory

The issue has already been detected and fixed upstream (see [1]) and is
expected to be released on a v2.5.1, but this release seems to be stalled
for now (see [2]). Bump on current master, which currently reflects what
will likely be the 2.5.1.

[1] https://github.com/ppp-project/ppp/issues/419
[2] https://github.com/ppp-project/ppp/issues/460

Signed-off-by: Alexis Lothoré <alexis.lothore@bootlin.com>
Signed-off-by: Thomas Petazzoni <thomas.petazzoni@bootlin.com>
(cherry picked from commit c1b04a3254)
Signed-off-by: Peter Korsgaard <peter@korsgaard.com>
2024-05-31 18:52:56 +02:00
Julien Olivain f4a7b485a3 support/testing: add netsnmp runtime test
Signed-off-by: Julien Olivain <ju.o@free.fr>
Signed-off-by: Thomas Petazzoni <thomas.petazzoni@bootlin.com>
(cherry picked from commit 639f507479)
Signed-off-by: Peter Korsgaard <peter@korsgaard.com>
2024-05-31 18:04:02 +02:00
Julien Olivain a103e3dca8 support/testing: add ethtool runtime test
Signed-off-by: Julien Olivain <ju.o@free.fr>
Signed-off-by: Thomas Petazzoni <thomas.petazzoni@bootlin.com>
(cherry picked from commit 0623c53054)
Signed-off-by: Peter Korsgaard <peter@korsgaard.com>
2024-05-31 17:17:34 +02:00
Fabrice Fontaine a513846df7 package/libjwt: security bump to version 1.17.0
- Use official tarball and so drop autoreconf
- Update hash of LICENSE file, verbatim copy of the current MPL 2.0 with
  https://github.com/benmcollins/libjwt/commit/ebebb5027f37a85c40c072a02681e206d31875ca
- Fix CVE-2024-25189: libjwt 1.15.3 uses strcmp (which is not constant
  time) to verify authentication, which makes it easier to bypass
  authentication via a timing side channel.

https://github.com/benmcollins/libjwt/compare/v1.15.3...v1.17.0

Signed-off-by: Fabrice Fontaine <fontaine.fabrice@gmail.com>
Signed-off-by: Thomas Petazzoni <thomas.petazzoni@bootlin.com>
(cherry picked from commit c65639ebd5)
Signed-off-by: Peter Korsgaard <peter@korsgaard.com>
2024-05-31 17:16:46 +02:00
Peter Korsgaard f9b33bfacb package/go: security bump to version 1.21.10
Fixes the following security issue:

CVE-2024-24787: cmd/go: arbitrary code execution during build on darwin

Signed-off-by: Peter Korsgaard <peter@korsgaard.com>
2024-05-31 16:47:10 +02:00
James Hilliard 9faa2751f3 package/network-manager: drop CONTRIBUTING.md from license files
This is irrelevant as of 402ad9fe54 (package/network-manager: bump
to version 1.22.10).

Details: https://lore.kernel.org/all/ZgXKrtfSjahxswtP@landeda/

Signed-off-by: James Hilliard <james.hilliard1@gmail.com>
Signed-off-by: Thomas Petazzoni <thomas.petazzoni@bootlin.com>
(cherry picked from commit dc21afed0f)
Signed-off-by: Peter Korsgaard <peter@korsgaard.com>
2024-05-27 17:53:54 +02:00
Fabrice Fontaine c919953694 package/zeromq: disable perf
Disable performance measurement tools which are enabled by default since
bump to version 4.2.5 in commit d3a8177e17

Signed-off-by: Fabrice Fontaine <fontaine.fabrice@gmail.com>
Signed-off-by: Thomas Petazzoni <thomas.petazzoni@bootlin.com>
(cherry picked from commit 8b1b438024)
Signed-off-by: Peter Korsgaard <peter@korsgaard.com>
2024-05-27 17:50:33 +02:00
Romain Naour 4eb7098a1a package/python-rpds-py: bump to version 0.18.1
As reported by Antoine Coutant on the Buildroot mailing list [1]:

rpds depends on the crate pyo3. This crate uses

  "std::sync::atomic::AtomicI64"

which doesn't exist for 32 bits targets.
That leads to an error as reported by Buildroot Gitlab-ci.

An issue have been opened on pyo3's github [2].
A fix have been accepted by pyo3 [3] and merged in pyo3 0.20.3 release
[4]. This pyo3 0.20.3 uses crate portable-atomic [5] to provide atomic
types and compare and swap operations for all targets that can use std.

python-rpds-py 0.18.1 is the first release that use pyo3 0.20.3.

Before python-rpds-py 0.18.1 release fixing this issue would require
that we be able to patch a package during the Cargo vendoring step [6].

[1] http://lists.busybox.net/pipermail/buildroot/2024-February/684867.html
[2]: https://github.com/PyO3/pyo3/issues/3614
[3]: https://github.com/PyO3/pyo3/pull/3619
[4]: https://github.com/PyO3/pyo3/blob/v0.20.3/CHANGELOG.md
[5]: https://github.com/taiki-e/portable-atomic
[6]: http://lists.busybox.net/pipermail/buildroot/2024-February/684886.html

Fixes:
https://gitlab.com/buildroot.org/buildroot/-/jobs/6783811842 (TestPythonPy3Dtschema)
https://gitlab.com/buildroot.org/buildroot/-/jobs/6783811860 (TestPythonPy3FlaskExpectsJson)

Reported-by: Antoine Coutant <antoine.coutant@smile.fr>
Cc: James Hilliard <james.hilliard1@gmail.com>
Signed-off-by: Romain Naour <romain.naour@smile.fr>
Signed-off-by: Thomas Petazzoni <thomas.petazzoni@bootlin.com>
(cherry picked from commit 26b054083d)
Signed-off-by: Peter Korsgaard <peter@korsgaard.com>
2024-05-27 17:42:52 +02:00
Fabrice Fontaine 7246f19516 package/openocd: fix build with libgpiod2
openocd is not compatible with libgpiod2 resulting in the following
build failure since the addition of libgpiod2 in commit
57391fad2e:

src/jtag/drivers/linuxgpiod.c: In function 'helper_get_line':
src/jtag/drivers/linuxgpiod.c:283:19: error: 'GPIOD_LINE_REQUEST_DIRECTION_INPUT' undeclared (first use in this function); did you mean 'GPIOD_LINE_DIRECTION_INPUT'?
  283 |         int dir = GPIOD_LINE_REQUEST_DIRECTION_INPUT, flags = 0, val = 0, retval;
      |                   ^~~~~~~~~~~~~~~~~~~~~~~~~~~~~~~~~~
      |                   GPIOD_LINE_DIRECTION_INPUT

Fixes: 57391fad2e
 - http://autobuild.buildroot.org/results/7195e8b76350f26ab3b963702d88b254512e6928

Signed-off-by: Fabrice Fontaine <fontaine.fabrice@gmail.com>
Signed-off-by: Thomas Petazzoni <thomas.petazzoni@bootlin.com>
(cherry picked from commit be3252fe01)
Signed-off-by: Peter Korsgaard <peter@korsgaard.com>
2024-05-27 16:41:21 +02:00
Fabrice Fontaine 41ef581ac5 package/suricata: fix static build
Fix the following static build failure raised since bump to version
version 6.0.14 in commit ce17f93e82 and
https://github.com/OISF/suricata/commit/31ba4fd1522dd0d7f933767b9205c67a4e726fe5:

configure:22378: checking for pcap_open_dead in -lpcap
configure:22407: /home/buildroot/autobuild/run/instance-3/output-1/host/bin/x86_64-linux-gcc -o conftest -D_LARGEFILE_SOURCE -D_LARGEFILE64_SOURCE -D_FILE_OFFSET_BITS=64  -O2 -g0  -static -std=c11 -march=native -D_LARGEFILE_SOURCE -D_LARGEFILE64_SOURCE -D_FILE_OFFSET_BITS=64  -static -rdynamic conftest.c -lpcap  -ljansson -lpthread -lyaml -lpcre -latomic -lz >&5
/home/buildroot/autobuild/run/instance-3/output-1/host/opt/ext-toolchain/bin/../lib/gcc/x86_64-buildroot-linux-musl/12.3.0/../../../../x86_64-buildroot-linux-musl/bin/ld: /home/buildroot/autobuild/run/instance-3/output-1/host/x86_64-buildroot-linux-musl/sysroot/usr/lib/../lib64/libpcap.a(pcap-linux.o): in function `nl80211_init':
pcap-linux.c:(.text+0xc34): undefined reference to `nl_socket_alloc'

[...]

checking for pcap_open_dead in -lpcap... no

Fixes: ce17f93e82
 - http://autobuild.buildroot.org/results/9e25c2508bd4100d2d1d3180e79060d762361213

Signed-off-by: Fabrice Fontaine <fontaine.fabrice@gmail.com>
Signed-off-by: Thomas Petazzoni <thomas.petazzoni@bootlin.com>
(cherry picked from commit a3ee47ef22)
Signed-off-by: Peter Korsgaard <peter@korsgaard.com>
2024-05-27 16:40:31 +02:00
Fabrice Fontaine 9a40ae8b98 package/libjwt: add CPE variables
cpe:2.3:a:bencollins:jwt_c_library is a valid CPE identifier for this
package:

  https://nvd.nist.gov/products/cpe/detail/6335E595-6F38-4837-83BB-C78B687BB75B

Signed-off-by: Fabrice Fontaine <fontaine.fabrice@gmail.com>
Signed-off-by: Thomas Petazzoni <thomas.petazzoni@bootlin.com>
(cherry picked from commit 1a2564e688)
Signed-off-by: Peter Korsgaard <peter@korsgaard.com>
2024-05-27 15:15:45 +02:00
Romain Naour 40d64599f4 package/perl-dbd-mysql: fix runtime issue with MariaDB
Now that the TestPerlDBDmysql can be run normally, a new runtime issue
appear due to switch from oracle-mysql to MariaDB:

  # perl -MDBI -e '1'
  # echo $?
  0

  # perl -MDBD::mysql -e '1'
  Can't load '/usr/lib/perl5/site_perl/5.38.2/arm-linux/auto/DBD/mysql/mysql.so'
  for module DBD::mysql: /usr/lib/perl5/site_perl/5.38.2/arm-linux/auto/DBD/mysql/mysql.so:
  undefined symbol: net_buffer_length at /usr/lib/perl5/5.38.2/arm-linux/DynaLoader.pm line 206.

This is fixed by an upstream commit [1] from 4.046_01 release.

[1] https://github.com/perl5-dbi/DBD-mysql/commit/0f0cebe87fab335873fd3701bc304922da826940

Fixes:
https://gitlab.com/buildroot.org/buildroot/-/jobs/6735654506

Signed-off-by: Romain Naour <romain.naour@smile.fr>
Signed-off-by: Thomas Petazzoni <thomas.petazzoni@bootlin.com>
(cherry picked from commit cefcd5bbad)
Signed-off-by: Peter Korsgaard <peter@korsgaard.com>
2024-05-27 15:14:00 +02:00
Romain Naour ed19064d16 support/testing: TestPerlDBDmysql: use ext2 instead of cpio
The CPIO filesystem generated by TestPerlDBDmysql is too large, and
doesn't fit as an initramfs in the 256MB of RAM available in the
versatilepb machine. This causes a failure while running a basic
test "perl -MDBI -e '1'" since "/usr/lib/perl5", and many files
being missing from the root filesystem, ultimately causing the test
to fail.

Can't locate DBI.pm in @INC (you may need to install the DBI module)
(@INC entries checked: /usr/lib/perl5/site_perl/5.38.2/arm-linux
/usr/lib/perl5/site_perl/5.38.2 /usr/lib/perl5/5.38.2/arm-linux
/usr/lib/perl5/5.38.2).

It would make sense to switch all test cases to use ext2 + a
hard-drive, but for now, let's fix the few test cases that are causing
problems.

Fixes:
https://gitlab.com/buildroot.org/buildroot/-/jobs/6735654506

Signed-off-by: Romain Naour <romain.naour@smile.fr>
Signed-off-by: Thomas Petazzoni <thomas.petazzoni@bootlin.com>
(cherry picked from commit 8937cd065c)
Signed-off-by: Peter Korsgaard <peter@korsgaard.com>
2024-05-27 15:12:59 +02:00
Fabrice Fontaine f25bd45082 package/pppd: add linux-pam optional dependency
linux-pam is an optional dependency which is enbled by default since
bump to version 2.5.0 in commit 0c15169f5a
and
https://github.com/ppp-project/ppp/commit/2883dd07101bf851e2ea368f0c04c91aea85cff2

Signed-off-by: Fabrice Fontaine <fontaine.fabrice@gmail.com>
Signed-off-by: Thomas Petazzoni <thomas.petazzoni@bootlin.com>
(cherry picked from commit bbcf02c7ff)
Signed-off-by: Peter Korsgaard <peter@korsgaard.com>
2024-05-27 15:07:13 +02:00
Fabrice Fontaine 3dd6a82e3a package/libutempter: do not hardcode PIE
PIE will be set by buildroot if the user wants it so set
{COMPILE,LINK}_PIE to an empty value to fix the following build failure
raised since the addition of the package in commit
02c818bc5c:

/home/buildroot/autobuild/run/instance-3/output-1/host/bin/m68k-linux-gcc -W -Wall -Waggregate-return -Wcast-align -Wconversion -Wdisabled-optimization -Wmissing-declarations -Wmissing-format-attribute -Wmissing-noreturn -Wmissing-prototypes -Wpointer-arith -Wredundant-decls -Wshadow -Wstrict-prototypes -Wwrite-strings -D_LARGEFILE_SOURCE -D_LARGEFILE64_SOURCE -D_FILE_OFFSET_BITS=64  -O2 -g0   -std=gnu99  -DLIBEXECDIR=\"/usr/lib\" -D_LARGEFILE_SOURCE -D_LARGEFILE64_SOURCE -D_FILE_OFFSET_BITS=64 -Wl,-z,relro -Wl,-stats   -fPIE -pie -Wl,-z,now  utempter.c -o utempter

[...]

/home/buildroot/autobuild/run/instance-3/output-1/host/opt/ext-toolchain/bin/../lib/gcc/m68k-buildroot-linux-uclibc/12.3.0/../../../../m68k-buildroot-linux-uclibc/bin/ld: /home/buildroot/autobuild/run/instance-3/output-1/host/m68k-buildroot-linux-uclibc/sysroot/usr/lib/Scrt1.o: in function `lib_main':
(.text+0x4): undefined reference to `__shared_flat_add_library'

Fixes: 02c818bc5c
 - http://autobuild.buildroot.org/results/3a5581fd4edf56bbdc48ab111a2351fc70f1c703

Signed-off-by: Fabrice Fontaine <fontaine.fabrice@gmail.com>
Signed-off-by: Thomas Petazzoni <thomas.petazzoni@bootlin.com>
(cherry picked from commit 36b06928c8)
Signed-off-by: Peter Korsgaard <peter@korsgaard.com>
2024-05-27 14:57:19 +02:00
Fabrice Fontaine 944a5d556a package/liburiparser: security bump to version 0.9.8
- Fixed: [CVE-2024-34402]
    Protect against integer overflow in ComposeQueryEngine
- Fixed: [CVE-2024-34403]
    Protect against integer overflow in ComposeQueryMallocExMm

https://github.com/uriparser/uriparser/blob/uriparser-0.9.8/ChangeLog

Signed-off-by: Fabrice Fontaine <fontaine.fabrice@gmail.com>
Signed-off-by: Thomas Petazzoni <thomas.petazzoni@bootlin.com>
(cherry picked from commit 6fe29e41cc)
Signed-off-by: Peter Korsgaard <peter@korsgaard.com>
2024-05-27 07:59:56 +02:00
Fabrice Fontaine 40205fa62b package/oprofile: fix static build with binutils >= 2.40
sframe library was added by binutils 2.40 and
https://github.com/bminor/binutils-gdb/commit/19e559f1c91bfaedbd2f91d85ee161f3f03fda3c
resulting in the following static build failure:

/home/buildroot/autobuild/run/instance-1/output-1/build/binutils-2.41/bfd/elf-sframe.c:220: undefined reference to `sframe_decode'

[...]

configure: error: bfd library not found

Fixes:
 - http://autobuild.buildroot.org/results/a9f3e09e6543b3773440c011e93bd41e357691e4

Signed-off-by: Fabrice Fontaine <fontaine.fabrice@gmail.com>
Signed-off-by: Thomas Petazzoni <thomas.petazzoni@bootlin.com>
(cherry picked from commit 5272c6bea1)
Signed-off-by: Peter Korsgaard <peter@korsgaard.com>
2024-05-27 07:58:58 +02:00
Fabrice Fontaine 47bc873569 package/suricata: security bump to version 6.0.19
Fixes:
 - CVE-2024-23839 - Critical severity
 - CVE-2024-23836 - Critical severity
 - CVE-2024-23835 - High severity
 - CVE-2024-24568 - Moderate severity
 - CVE-2024-28870 - HIGH
 - CVE-2024-32663 CRITICAL (HIGH for 6.0.x)
 - CVE-2024-32664 CRITICAL (HIGH for 7.0.x)
 - CVE-2024-32867 MODERATE

https://forum.suricata.io/t/suricata-7-0-3-and-6-0-16-released/4468
https://forum.suricata.io/t/suricata-7-0-4-and-6-0-17-released/4534
https://forum.suricata.io/t/suricata-6-0-18-released/4539
https://forum.suricata.io/t/suricata-7-0-5-and-6-0-19-released/4617

Signed-off-by: Fabrice Fontaine <fontaine.fabrice@gmail.com>
Signed-off-by: Thomas Petazzoni <thomas.petazzoni@bootlin.com>
(cherry picked from commit a8e60c4600)
Signed-off-by: Peter Korsgaard <peter@korsgaard.com>
2024-05-27 07:57:37 +02:00
Fabrice Fontaine baaf5f569f package/libhtp: security bump to version 0.5.48
Fix CVE-2024-23837 and CVE-2024-28871

https://github.com/OISF/libhtp/security/advisories/GHSA-f9wf-rrjj-qx8m
https://github.com/OISF/libhtp/security/advisories/GHSA-ffr2-45w9-7wmg
https://github.com/OISF/libhtp/blob/0.5.48/ChangeLog

Signed-off-by: Fabrice Fontaine <fontaine.fabrice@gmail.com>
Signed-off-by: Thomas Petazzoni <thomas.petazzoni@bootlin.com>
(cherry picked from commit babb39c873)
Signed-off-by: Peter Korsgaard <peter@korsgaard.com>
2024-05-27 07:57:15 +02:00
Peter Korsgaard a6f9dff3af configs/sheevaplug_defconfig: add hashes for u-boot and Linux
And enable BR2_DOWNLOAD_FORCE_CHECK_HASHES.

Generated by utils/add-custom-hashes, with the (redundant)
linux-headers.hash replaced by a symlink.

Signed-off-by: Peter Korsgaard <peter@korsgaard.com>
Signed-off-by: Thomas Petazzoni <thomas.petazzoni@bootlin.com>
(cherry picked from commit 56ce35d235)
Signed-off-by: Peter Korsgaard <peter@korsgaard.com>
2024-05-27 07:56:24 +02:00
Peter Korsgaard 97b20fa17c configs/sheevaplug_defconfig: bump Linux to fix binutils 2.41 build
Fixes:
https://gitlab.com/buildroot.org/buildroot/-/jobs/6761770801

The Linux kernel fails to build since commit e88225ed88 (package/binutils:
make 2.41 the default version):

arch/arm/mm/proc-feroceon.S: Assembler messages:
arch/arm/mm/proc-feroceon.S:587: Error: junk at end of line, first unrecognized character is `#'
make[3]: *** [scripts/Makefile.build:430: arch/arm/mm/proc-feroceon.o] Error 1
make[3]: *** Waiting for unfinished jobs....

Fix the build by bumping the kernel to 4.14.336, which includes commit
3ab03df64f77 (ARM: 8933/1: replace Sun/Solaris style flag on section
directive):

https://git.kernel.org/pub/scm/linux/kernel/git/stable/linux.git/commit/?h=linux-4.14.y&id=3ab03df64f7754728a2257c47775a70a88428331

Signed-off-by: Peter Korsgaard <peter@korsgaard.com>
Signed-off-by: Thomas Petazzoni <thomas.petazzoni@bootlin.com>
(cherry picked from commit c0dc1b3425)
Signed-off-by: Peter Korsgaard <peter@korsgaard.com>
2024-05-27 07:54:24 +02:00
Fabrice Fontaine 1cfabbf913 package/pppd: fix build with kernel < 4.7
Fix the following build failure with kernel < 4.7 raised since bump to
version 2.5.0 in commit 0c15169f5a and
https://github.com/ppp-project/ppp/commit/81ad945630120cc1c27c8bb00503be42b76ff202:

sys-linux.c: In function 'get_ppp_stats_rtnetlink':
sys-linux.c:1783:29: error: field 'ifsm' has incomplete type
 1783 |         struct if_stats_msg ifsm;
      |                             ^~~~

Fixes:
 - http://autobuild.buildroot.org/results/82392df447f650f241f23e59e65131fb4a930010

Signed-off-by: Fabrice Fontaine <fontaine.fabrice@gmail.com>
Signed-off-by: Thomas Petazzoni <thomas.petazzoni@bootlin.com>
(cherry picked from commit 45c1def991)
Signed-off-by: Peter Korsgaard <peter@korsgaard.com>
2024-05-27 07:52:31 +02:00
Fabrice Fontaine 20dc0f23f4 package/shadow: fix NLS build
NLS is an optional dependency since the addition of the package in
commit f78c5cb5ca:

/home/autobuild/autobuild/instance-0/output-1/host/lib/gcc/arm-buildroot-linux-musleabi/12.3.0/../../../../arm-buildroot-linux-musleabi/bin/ld: ../lib/.libs/libshadow.a(libshadow_la-alloc.o): in function `xcalloc':
alloc.c:(.text+0x7c): undefined reference to `libintl_gettext'

Fixes: f78c5cb5ca
 - http://autobuild.buildroot.org/results/9f604d09745ffa1f4db3bdcfe0326c236effac0c

Signed-off-by: Fabrice Fontaine <fontaine.fabrice@gmail.com>
Signed-off-by: Thomas Petazzoni <thomas.petazzoni@bootlin.com>
(cherry picked from commit f82384652c)
Signed-off-by: Peter Korsgaard <peter@korsgaard.com>
2024-05-27 07:52:07 +02:00
Peter Seiderer 2842ea60ff package/x11r7/Config.in: source argument needs quotation marks
Fixes the following error/warnings with kconfig from linux-6.9-rc5:

  package/x11r7/Config.in:14: syntax error
  package/x11r7/Config.in:14:warning: ignoring unsupported character '/'
  package/x11r7/Config.in:14:warning: ignoring unsupported character '/'
  package/x11r7/Config.in:14:warning: ignoring unsupported character '/'
  package/x11r7/Config.in:14:warning: ignoring unsupported character '.'
  package/x11r7/Config.in:14: invalid statement
  [...]

Signed-off-by: Peter Seiderer <ps.report@gmx.net>
Signed-off-by: Thomas Petazzoni <thomas.petazzoni@bootlin.com>
(cherry picked from commit a214c4568b)
Signed-off-by: Peter Korsgaard <peter@korsgaard.com>
2024-05-26 22:44:32 +02:00
Peter Seiderer c3ce1d642c package/python-pydal/Config.in: bool argument needs quotation marks
Fixes the following error/warnings with kconfig from linux-6.9-rc5:

  package/python-pydal/Config.in:2: syntax error
  package/python-pydal/Config.in:2: invalid statement
  package/python-pydal/Config.in:3: invalid statement
  [...]

Signed-off-by: Peter Seiderer <ps.report@gmx.net>
Signed-off-by: Thomas Petazzoni <thomas.petazzoni@bootlin.com>
(cherry picked from commit 9f8d3f47d7)
Signed-off-by: Peter Korsgaard <peter@korsgaard.com>
2024-05-26 22:44:26 +02:00
Peter Seiderer 033a9a64a6 package/dovecot/Config.in: source argument needs quotation marks
Fixes the following error/warnings with kconfig from linux-6.9-rc5:

  package/dovecot/Config.in:36: syntax error
  package/dovecot/Config.in:36:warning: ignoring unsupported character '/'
  package/dovecot/Config.in:36:warning: ignoring unsupported character '/'
  package/dovecot/Config.in:36:warning: ignoring unsupported character '.'
  package/dovecot/Config.in:36: invalid statement

Signed-off-by: Peter Seiderer <ps.report@gmx.net>
Signed-off-by: Thomas Petazzoni <thomas.petazzoni@bootlin.com>
(cherry picked from commit ff70f9ee4c)
Signed-off-by: Peter Korsgaard <peter@korsgaard.com>
2024-05-26 22:44:17 +02:00
Peter Seiderer 7dfb9a9ce9 package/cmocka/Config.in: bool argument needs quotation marks
Fixes the following error/warnings with kconfig from linux-6.9-rc5:

  package/cmocka/Config.in:2: syntax error
  package/cmocka/Config.in:2: invalid statement
  package/cmocka/Config.in:3: invalid statement
  package/cmocka/Config.in:4: invalid statement
  [...]

Signed-off-by: Peter Seiderer <ps.report@gmx.net>
Signed-off-by: Thomas Petazzoni <thomas.petazzoni@bootlin.com>
(cherry picked from commit 4abda655e6)
Signed-off-by: Peter Korsgaard <peter@korsgaard.com>
2024-05-26 22:44:01 +02:00
Peter Seiderer a012c44201 boot/barebox/Config.in: source argument needs quotation marks
Fixes the following error/warnings with kconfig from linux-6.9-rc5:

  boot/barebox/Config.in:79: syntax error
  boot/barebox/Config.in:79:warning: ignoring unsupported character '/'
  boot/barebox/Config.in:79:warning: ignoring unsupported character '/'
  boot/barebox/Config.in:79:warning: ignoring unsupported character '/'
  boot/barebox/Config.in:79:warning: ignoring unsupported character '.'
  boot/barebox/Config.in:79: invalid statement
  boot/barebox/Config.in:93: syntax error
  boot/barebox/Config.in:93:warning: ignoring unsupported character '/'
  boot/barebox/Config.in:93:warning: ignoring unsupported character '/'
  boot/barebox/Config.in:93:warning: ignoring unsupported character '/'
  boot/barebox/Config.in:93:warning: ignoring unsupported character '.'
  boot/barebox/Config.in:93: invalid statement

Signed-off-by: Peter Seiderer <ps.report@gmx.net>
Signed-off-by: Thomas Petazzoni <thomas.petazzoni@bootlin.com>
(cherry picked from commit e86aec1663)
Signed-off-by: Peter Korsgaard <peter@korsgaard.com>
2024-05-26 21:57:39 +02:00
Edgar Bonet 19b09e735b configs/acmesystems_acqua_a5_*: bump to Linux 6.6.30
Signed-off-by: Edgar Bonet <bonet@grenoble.cnrs.fr>
Signed-off-by: Thomas Petazzoni <thomas.petazzoni@bootlin.com>
(cherry picked from commit 74787fdd10)
Signed-off-by: Peter Korsgaard <peter@korsgaard.com>
2024-05-26 21:56:44 +02:00
Edgar Bonet 1cd481ac92 configs/acmesystems_acqua_a5_*: add hashes for Linux/at91bootstrap3
And enable BR2_DOWNLOAD_FORCE_CHECK_HASHES.

Signed-off-by: Edgar Bonet <bonet@grenoble.cnrs.fr>
Signed-off-by: Thomas Petazzoni <thomas.petazzoni@bootlin.com>
(cherry picked from commit 7f5cd99dd7)
Signed-off-by: Peter Korsgaard <peter@korsgaard.com>
2024-05-26 21:55:41 +02:00
Dario Binacchi aa11275c9d package/qemu: renumber patch
Commit 3fa1ae0068 ("package/qemu: add option to enable tracing")
added a patch with a wrong number.

Signed-off-by: Dario Binacchi <dario.binacchi@amarulasolutions.com>
Signed-off-by: Yann E. MORIN <yann.morin.1998@free.fr>
(cherry picked from commit bf8e4c2052)
Signed-off-by: Peter Korsgaard <peter@korsgaard.com>
2024-05-26 21:47:11 +02:00
Dario Binacchi 55a7000a7d package/qemu: fix disabling fp-bench test compilation
With the bump to version 8.1.1, the patch that disabled the compilation
of the fp-bench test is no longer applicable, even though the package
compilation process does not report any errors in applying the patch
itself. The new patch does not disable the test by default but only if
the file fenv.h is not missing, with the hope that this approach will be
considered acceptable by the maintainer and merged upstream.

The patch is an adaptation of the one sent upstream.

Link: https://lists.nongnu.org/archive/html/qemu-devel/2021-03/msg00492.html
Signed-off-by: Dario Binacchi <dario.binacchi@amarulasolutions.com>
Signed-off-by: Yann E. MORIN <yann.morin.1998@free.fr>
(cherry picked from commit 2bb0c57ca2)
Signed-off-by: Peter Korsgaard <peter@korsgaard.com>
2024-05-26 21:46:32 +02:00
Fabrice Fontaine 330a987a53 package/kexec: fix x86_64 build with binutils 2.41
Fix the following x86_64 build failure with binutils 2.41:

purgatory/arch/i386/entry32-16.S:23: Error: 64bit mode not supported on `i386'.

Fixes:
 - http://autobuild.buildroot.org/results/60f2f163b491879a8ea7f2d56a6b0d38b3cf439c

Signed-off-by: Fabrice Fontaine <fontaine.fabrice@gmail.com>
Signed-off-by: Yann E. MORIN <yann.morin.1998@free.fr>
(cherry picked from commit a2be156169)
Signed-off-by: Peter Korsgaard <peter@korsgaard.com>
2024-05-22 08:19:55 +02:00
Peter Seiderer 8ee092e337 package/git: security bump version to 2.43.4
Fixes CVE-2024-32002, CVE-2024-32004, CVE-2024-32020 and CVE-2024-32021
(for details see [1]).

[1] https://lore.kernel.org/lkml/xmqqv83g4937.fsf@gitster.g/

Signed-off-by: Peter Seiderer <ps.report@gmx.net>
Signed-off-by: Peter Korsgaard <peter@korsgaard.com>
2024-05-22 08:14:14 +02:00
Fabrice Fontaine 3edd6d9fce package/ti-sgx-km: needs BR2_ARM_EABIHF
ti-sgx-km raises the following build failure without BR2_ARM_EABIHF:

eurasiacon/build/linux2/toplevel.mk:230: eurasiacon/build/linux2/moduledefs/target_armel.mk: No such file or directory

Fixes:
 - http://autobuild.buildroot.org/results/17e4da346d062570b9a84ab8eb1ce93c6d7384be
 - http://autobuild.buildroot.org/results/04fd659472f1928c2621354bb0ea3b60c5dfadec

Signed-off-by: Fabrice Fontaine <fontaine.fabrice@gmail.com>
Signed-off-by: Thomas Petazzoni <thomas.petazzoni@bootlin.com>
(cherry picked from commit 5924a5c2c6)
Signed-off-by: Peter Korsgaard <peter@korsgaard.com>
2024-05-22 08:12:48 +02:00
Brandon Maier ad20908243 boot/arm-trusted-firmware: enable verbose output
Signed-off-by: Brandon Maier <brandon.maier@collins.com>
Signed-off-by: Thomas Petazzoni <thomas.petazzoni@bootlin.com>
(cherry picked from commit a8c7a53985)
Signed-off-by: Peter Korsgaard <peter@korsgaard.com>
2024-05-22 08:11:55 +02:00
Fabrice Fontaine 222220d06e package/proj: needs NPTL
NPTL is mandatory since bump to version 9.3.0 in commit
57aba033e6 and
https://github.com/OSGeo/PROJ/commit/ce080251225d16e11e139a5ebe07cf608fe022b2:

/home/buildroot/instance-0/output-1/build/proj-9.3.0/src/iso19111/factory.cpp: In member function 'std::shared_ptr<osgeo::proj::io::SQLiteHandle> osgeo::proj::io::SQLiteHandleCache::getHandle(const std::string&, PJ_CONTEXT*)':
/home/buildroot/instance-0/output-1/build/proj-9.3.0/src/iso19111/factory.cpp:622:9: error: 'pthread_atfork' was not declared in this scope; did you mean 'pthread_attr_t'?
  622 |         pthread_atfork(nullptr, nullptr,
      |         ^~~~~~~~~~~~~~
      |         pthread_attr_t

Fixes: 57aba033e6
 - http://autobuild.buildroot.org/results/392664375c5bc5f047d39bff31534a226e8ea526

Signed-off-by: Fabrice Fontaine <fontaine.fabrice@gmail.com>
Reviewed-by: Maxim Kochetkov <fido_max@inbox.ru>
Signed-off-by: Yann E. MORIN <yann.morin.1998@free.fr>
(cherry picked from commit 4eeb69c983)
Signed-off-by: Peter Korsgaard <peter@korsgaard.com>
2024-05-21 22:16:42 +02:00
Fabrice Fontaine e26c33a4b9 package/libglib2: update atomic patch
Commit 929bffbf4b forgot to update patch
number
Moreover, replace it with a new iteration to follow upstream request [1]
and avoid the following build host build failure with br-autobuild-1:

/usr/bin/ld: cannot find /usr/lib64/libatomic.so.1.2.0: No such file or directory

Fixes: 929bffbf4b
 - http://autobuild.buildroot.org/results/a12b9c4436594818f4ce128595b429adf7d90e31

[1]: https://gitlab.gnome.org/GNOME/glib/-/merge_requests/3606

Signed-off-by: Fabrice Fontaine <fontaine.fabrice@gmail.com>
[yann.morin.1998@free.fr: mention upstream commit now it's merged]
Signed-off-by: Yann E. MORIN <yann.morin.1998@free.fr>
(cherry picked from commit f5257789d6)
Signed-off-by: Peter Korsgaard <peter@korsgaard.com>
2024-05-21 22:11:53 +02:00
Fabrice Fontaine 5c7927f698 package/libglib2: fix atomic handling
Correctly fix atomic handling to avoid the following build failure with
all users of libglib2 (e.g. gdk-pixbuf) raised since bump to version
2.76.1 in commit 3f9622fe3d:

/usr/lib/libglib-2.0.a(gthread-posix.c.o): in function `g_mutex_trylock':
gthread-posix.c:(.text+0xda8): undefined reference to `__atomic_compare_exchange_4'

Fixes:
 - http://autobuild.buildroot.org/results/24a358869b98d83ab374c7c3a185ced450064d35

Signed-off-by: Fabrice Fontaine <fontaine.fabrice@gmail.com>
Signed-off-by: Thomas Petazzoni <thomas.petazzoni@bootlin.com>
(cherry picked from commit 929bffbf4b)
Signed-off-by: Peter Korsgaard <peter@korsgaard.com>
2024-05-21 22:05:00 +02:00
Bernd Kuhls 535c0a5ada package/libpng: bump version to 1.6.43
Release notes:
https://sourceforge.net/p/png-mng/mailman/message/58741099/

Signed-off-by: Bernd Kuhls <bernd@kuhls.net>
Signed-off-by: Thomas Petazzoni <thomas.petazzoni@bootlin.com>
(cherry picked from commit ce3ce432fe)
Signed-off-by: Peter Korsgaard <peter@korsgaard.com>
2024-05-21 14:14:42 +02:00
Michael Nosthoff f5c0965c24 package/catch2: bump to version 3.5.4
Signed-off-by: Michael Nosthoff <buildroot@heine.tech>
Signed-off-by: Thomas Petazzoni <thomas.petazzoni@bootlin.com>
(cherry picked from commit 30a88f4ab0)
Signed-off-by: Peter Korsgaard <peter@korsgaard.com>
2024-05-21 14:05:27 +02:00
Bernd Kuhls de61d8390a package/cmake: add BR2_HOST_CMAKE_AT_LEAST_3_28
Buildroot commit 38d07349da forgot to
add the corresponding BR2_HOST_CMAKE_AT_LEAST_X_Y option.

Signed-off-by: Bernd Kuhls <bernd@kuhls.net>
Signed-off-by: Romain Naour <romain.naour@smile.fr>
(cherry picked from commit 81d7103a10)
Signed-off-by: Peter Korsgaard <peter@korsgaard.com>
2024-05-21 14:02:18 +02:00
Bernd Kuhls 00d911b9c6 package/intel-gmmlib: bump version to 22.3.19
Signed-off-by: Bernd Kuhls <bernd@kuhls.net>
Signed-off-by: Thomas Petazzoni <thomas.petazzoni@bootlin.com>
(cherry picked from commit d476d2e7e5)
Signed-off-by: Peter Korsgaard <peter@korsgaard.com>
2024-05-21 11:28:28 +02:00
Bernd Kuhls a685e7866b package/tor: bump version to 0.4.8.11
Release notes:
https://gitlab.torproject.org/tpo/core/tor/-/raw/release-0.4.8/ReleaseNotes
https://forum.torproject.org/t/stable-release-0-4-8-11/12265

Signed-off-by: Bernd Kuhls <bernd@kuhls.net>
Signed-off-by: Thomas Petazzoni <thomas.petazzoni@bootlin.com>
(cherry picked from commit f1723c93b5)
Signed-off-by: Peter Korsgaard <peter@korsgaard.com>
2024-05-21 11:27:53 +02:00
Francois Perrad b392df5443 package/libarchive: bump to version 3.7.3
Signed-off-by: Francois Perrad <francois.perrad@gadz.org>
Signed-off-by: Thomas Petazzoni <thomas.petazzoni@bootlin.com>
(cherry picked from commit 566eb38bdf)
Signed-off-by: Peter Korsgaard <peter@korsgaard.com>
2024-05-21 11:25:56 +02:00
Romain Naour 99eafd1cc6 DEVELOPERS: remove Sebastian Weyer
Sebastian email address at Smile is bouncing, so drop it
from the DEVELOPERS file.

Signed-off-by: Romain Naour <romain.naour@smile.fr>
Signed-off-by: Yann E. MORIN <yann.morin.1998@free.fr>
(cherry picked from commit 7b973daac3)
Signed-off-by: Peter Korsgaard <peter@korsgaard.com>
2024-05-16 14:24:31 +02:00
Sébastien Szymanski 27e7c199cf DEVELOPERS: add myself for Armadeus boards
Signed-off-by: Sébastien Szymanski <sebastien.szymanski@armadeus.com>
Signed-off-by: Romain Naour <romain.naour@smile.fr>
(cherry picked from commit 74c0cf2152)
Signed-off-by: Peter Korsgaard <peter@korsgaard.com>
2024-05-16 14:22:40 +02:00
Jan Čermák 4415daf635 package/linux-pam: bump to version 1.6.1
Bump to latest version, fixing couple of bugs. Remove patch already
included in this release.

https://github.com/linux-pam/linux-pam/releases/tag/v1.6.1

Signed-off-by: Jan Čermák <sairon@sairon.cz>
Signed-off-by: Thomas Petazzoni <thomas.petazzoni@bootlin.com>
(cherry picked from commit 0d394c39b8)
Signed-off-by: Peter Korsgaard <peter@korsgaard.com>
2024-05-16 13:07:27 +02:00
Julien Olivain 48275e431f package/fwts: update _SITE url to use https
The http URL redirects to https. This commit updates this URL to
directly use https.

Signed-off-by: Julien Olivain <ju.o@free.fr>
Signed-off-by: Thomas Petazzoni <thomas.petazzoni@bootlin.com>
(cherry picked from commit 2aa3a23bbe)
Signed-off-by: Peter Korsgaard <peter@korsgaard.com>
2024-05-16 11:41:54 +02:00
Julien Olivain 2b8ca3cfbe support/testing: add fwts runtime test
Signed-off-by: Julien Olivain <ju.o@free.fr>
Signed-off-by: Thomas Petazzoni <thomas.petazzoni@bootlin.com>
(cherry picked from commit 7c1faf997f)
Signed-off-by: Peter Korsgaard <peter@korsgaard.com>
2024-05-16 11:41:28 +02:00
Julien Olivain 1f383f120e support/testing: add iperf runtime test
Signed-off-by: Julien Olivain <ju.o@free.fr>
Signed-off-by: Thomas Petazzoni <thomas.petazzoni@bootlin.com>
(cherry picked from commit 6317f6c9a4)
Signed-off-by: Peter Korsgaard <peter@korsgaard.com>
2024-05-16 11:35:30 +02:00
Fabrice Fontaine f2eb227317 package/coreutils: drop gmp optional dependency
libgmp is included in coreutils (through bootstrap.conf) since bump to
version 9.0 in commit 2ee43bad85 and
https://git.savannah.gnu.org/cgit/coreutils.git/commit/?id=13046444888a7e96f48d28fdd5a6ffe03d4ab036:

configure: WARNING: unrecognized options: --disable-gtk-doc, --disable-gtk-doc-html, --disable-doc, --disable-docs, --disable-documentation, --with-xmlto, --with-fop, --enable-ipv6, --enable-static, --enable-shared, --without-gmp

Fixes: 2ee43bad85

Signed-off-by: Fabrice Fontaine <fontaine.fabrice@gmail.com>
Signed-off-by: Thomas Petazzoni <thomas.petazzoni@bootlin.com>
(cherry picked from commit 16463a00af)
Signed-off-by: Peter Korsgaard <peter@korsgaard.com>
2024-05-16 11:27:46 +02:00
Fabrice Fontaine bb7a0c27d4 package/apcupsd: set ac_cv_path_SHUTDOWN
Set ac_cv_path_SHUTDOWN to /sbin/shutdown to avoid the following build
failure when shutdown is not available on host raised since the addition
of the package in commit d12b63b741:

configure: error: Missing required tool; need any one of: shutdown shutdown.bsd

Fixes: d12b63b741
 - http://autobuild.buildroot.org/results/a8bbb5ced8343e08070361f260050de422144710

Signed-off-by: Fabrice Fontaine <fontaine.fabrice@gmail.com>
Signed-off-by: Thomas Petazzoni <thomas.petazzoni@bootlin.com>
(cherry picked from commit 640a79000b)
Signed-off-by: Peter Korsgaard <peter@korsgaard.com>
2024-05-15 17:30:35 +02:00
Julien Olivain 8811a2d0eb package/fluidsynth: bump to version 2.3.5
For change log since v2.3.4, see:
- https://github.com/FluidSynth/fluidsynth/releases/tag/v2.3.5

Signed-off-by: Julien Olivain <ju.o@free.fr>
Signed-off-by: Thomas Petazzoni <thomas.petazzoni@bootlin.com>
(cherry picked from commit 0215a6d6f6)
Signed-off-by: Peter Korsgaard <peter@korsgaard.com>
2024-05-15 17:29:33 +02:00
Konstantin Aladyshev 3c14bcebcb configs/pc_x86_64_{bios, efi}_defconfig: add wireless regdb
Wireless regulatory database lists the allowed radio frequencies for
each local jurisdiction. Since linux-4.15 the kernel supports loading
the files regulatory.db/regulatory.db.p7s directly from the
/lib/firmware directory. Currently this package is not enabled and
kernel complains with the following message on every boot:
"""
platform regulatory.0: Direct firmware load for regulatory.db failed
with error -2
cfg80211: failed to load regulatory.db
"""
Add wireless regulatory database package to fix the issue.

Signed-off-by: Konstantin Aladyshev <aladyshev22@gmail.com>
Signed-off-by: Thomas Petazzoni <thomas.petazzoni@bootlin.com>
(cherry picked from commit 16e9f51490)
Signed-off-by: Peter Korsgaard <peter@korsgaard.com>
2024-05-15 17:27:31 +02:00
Gero Schwäricke e036a25271 configs/raspberrypizero2w_defconfig: fix typo in headers series option
The build for this defconfig fails with:

  Incorrect selection of kernel headers: expected 6.8.x, got 6.1.x

Found with the following command while trying to find boards that have
missing custom headers series:

  grep --null --recursive --files-without-match "BR2_TOOLCHAIN_EXTERNAL=y" ./configs \
    | xargs --null grep --null --files-with-matches "BR2_LINUX_KERNEL_CUSTOM_.*=y" \
    | xargs --null grep --null --files-without-match "BR2_KERNEL_HEADERS_[0-9]\+_[0-9]\+=y"\
    | xargs --null grep --files-without-match "BR2_PACKAGE_HOST_LINUX_HEADERS_CUSTOM_[0-9]\+_[0-9]\+=y"
  ./configs/mangopi_mq1rdw2_defconfig  # patch pending
  ./configs/raspberrypizero2w_defconfig
  ./configs/sipeed_licheepi_nano_defconfig  # patch pending

Fixes:
https://gitlab.com/buildroot.org/buildroot/-/jobs/6712162631

Signed-off-by: Gero Schwäricke <gero.schwaericke@posteo.de>
[Romain: add gitlab-ci link]
Signed-off-by: Romain Naour <romain.naour@smile.fr>
(cherry picked from commit dc18b639c9)
Signed-off-by: Peter Korsgaard <peter@korsgaard.com>
2024-05-15 17:09:37 +02:00
Gero Schwäricke f113543d83 configs/sipeed_licheepi_nano_defconfig: fix missing linux headers
The build failed with:

  Incorrect selection of kernel headers: expected 6.8.x, got 6.5.x

Fixes: https://gitlab.com/buildroot.org/buildroot/-/jobs/6498278078

Signed-off-by: Gero Schwäricke <gero.schwaericke@posteo.de>
Signed-off-by: Romain Naour <romain.naour@smile.fr>
(cherry picked from commit f5aac04c36)
Signed-off-by: Peter Korsgaard <peter@korsgaard.com>
2024-05-15 16:32:59 +02:00
Julien Olivain cd987cbcc1 configs/wandboard: uboot needs openssl
Fixes:
https://gitlab.com/buildroot.org/buildroot/-/jobs/6609466641

Signed-off-by: Julien Olivain <ju.o@free.fr>
Reviewed-by: Fabio Estevam <festevam@gmail.com>
Signed-off-by: Romain Naour <romain.naour@smile.fr>
(cherry picked from commit ffe920b644)
Signed-off-by: Peter Korsgaard <peter@korsgaard.com>
2024-05-15 15:34:14 +02:00
Romain Naour 0b892513d0 support/testing: TestF2FS: update kernel to 4.19.310
Since the toolchain Bootlin update to 2023.11-1 [1], the arm Linux
kernel build is broken with binutils >= 2.41 with:

  arch/arm/mm/proc-v7.S: Assembler messages:
  arch/arm/mm/proc-v7.S:640: Error: junk at end of line, first unrecognized character is `#'

A similar issue has already be fixed for qemu m68k [2].

Bump to the latest kernel 4.19 that already include the backport
of 790756c7e022 ("ARM: 8933/1: replace Sun/Solaris style flag on section directive")

[1] 7e0e6e3b86
[2] a1ce9474e4

Fixes:
https://gitlab.com/buildroot.org/buildroot/-/jobs/6703222383

Signed-off-by: Romain Naour <romain.naour@smile.fr>
(cherry picked from commit 7e126bd38d)
Signed-off-by: Peter Korsgaard <peter@korsgaard.com>
2024-05-15 15:25:16 +02:00
Romain Naour c8a229c850 support/testing: TestATFAllwinner: add missing openssl dependency
The commit [1] updated the u-boot version with the one used by
orangepi_zero_plus2_defconfig but the dependency on openssl
was forgotten.

Fixes:
https://gitlab.com/buildroot.org/buildroot/-/jobs/6703221868

[1] eb16148ddd

Signed-off-by: Romain Naour <romain.naour@smile.fr>
(cherry picked from commit bc75b09b1c)
Signed-off-by: Peter Korsgaard <peter@korsgaard.com>
2024-05-15 15:23:39 +02:00
Robert Marko f5a347c1dc kconfig/lxdialog: fix check() with GCC14
GCC14 now treats implicit int types as error so when check() from
check-lxdialog.sh is called to check whether we can link against ncurses
it will fail silently and the help text indicating to install ncurses is
printed.

However, this is not due to missing ncurses but once the stderr redirect
to /dev/null is removed we can see the root cause:
<stdin>:2:1: error: return type defaults to ‘int’ [-Wimplicit-int]

So, in order for menuconfig to work with GCC14 lets just specify the
return type of main() as int.

Npte that the upstream kconfig in the linux kernel source tree no longer
carries or uses the check-lxdialog.sh script since commit 1c5af5cf9308
(kconfig: refactor ncurses package checks for building mconf and nconf),
so there is no commit we can backport to our kconfig copy.

Signed-off-by: Robert Marko <robimarko@gmail.com>
Reviewed-by: Petr Vorel <petr.vorel@gmail.com>
Tested-by: Petr Vorel <petr.vorel@gmail.com>
[yann.morin.1998@free.fr: add note about upstream kernel]
Signed-off-by: Yann E. MORIN <yann.morin.1998@free.fr>
(cherry picked from commit a6210d28db)
Signed-off-by: Peter Korsgaard <peter@korsgaard.com>
2024-05-15 15:18:09 +02:00
Peter Seiderer 0d9357b3cc package/speechd: set CPE_ID_VENDOR (to silence mismatched CVE warning)
- set CPE_ID_VENDOR to silence mismatched CVE-2001-0956 ([1], [2]) warning
  clearly aiming some other product/version ("speechd 0.54 with Festival or
  rsynth speech synthesis package")

[1] https://security-tracker.debian.org/tracker/CVE-2001-0956
[2] https://github.com/advisories/GHSA-67cw-4jhh-3jm7

Signed-off-by: Peter Seiderer <ps.report@gmx.net>
Signed-off-by: Yann E. MORIN <yann.morin.1998@free.fr>
(cherry picked from commit 206527347c)
Signed-off-by: Peter Korsgaard <peter@korsgaard.com>
2024-05-07 22:49:41 +02:00
Peter Korsgaard 5e039782c3 package/docker-cli: bump version to 26.0.2
https://github.com/moby/moby/releases/tag/v26.0.2

Signed-off-by: Peter Korsgaard <peter@korsgaard.com>
Signed-off-by: Yann E. MORIN <yann.morin.1998@free.fr>
(cherry picked from commit 49c8154ee7)
Signed-off-by: Peter Korsgaard <peter@korsgaard.com>
2024-05-07 22:47:44 +02:00
Peter Korsgaard fe069fe639 package/docker-engine: security bump to version 26.0.2
Fixes the following security issues:

CVE-2024-32473: Ensure IPv6 is disabled on interfaces only allocated an IPv4
address by the engine

https://github.com/moby/moby/security/advisories/GHSA-x84c-p2g9-rqv9

Signed-off-by: Peter Korsgaard <peter@korsgaard.com>
Signed-off-by: Yann E. MORIN <yann.morin.1998@free.fr>
(cherry picked from commit 8e37a887e6)
Signed-off-by: Peter Korsgaard <peter@korsgaard.com>
2024-05-07 22:47:37 +02:00
Bernd Kuhls 1f3d93d773 {linux, linux-headers}: bump 4.19.x / 5.{4, 10, 15}.x / 6.{1, 6, 8}.x series
Signed-off-by: Bernd Kuhls <bernd@kuhls.net>
Signed-off-by: Arnout Vandecappelle <arnout@mind.be>
(cherry picked from commit 9c592ecd3e)
[Peter: drop 6.8.x bump]
Signed-off-by: Peter Korsgaard <peter@korsgaard.com>
2024-05-07 22:40:52 +02:00
Angelo Compagnucci 6a9b7909bb package/openjpeg: security bump to version 2.5.2
Fixes the following security issues:

CVE-2021-3575: A heap-based buffer overflow was found in openjpeg in
color.c:379:42 in sycc420_to_rgb when decompressing a crafted .j2k file.  An
attacker could use this to execute arbitrary code with the permissions of
the application compiled against openjpeg.

Signed-off-by: Angelo Compagnucci <angelo.compagnucci@gmail.com>
Signed-off-by: Peter Korsgaard <peter@korsgaard.com>
(cherry picked from commit ff36bc68cd)
Signed-off-by: Peter Korsgaard <peter@korsgaard.com>
2024-05-07 22:15:47 +02:00
Fabrice Fontaine 23337c0674 package/freerdp: security bump to version 2.11.6
Fix the following CVEs:

- CVE-2024-32041 [Low[ OutOfBound Read in zgfx_decompress_segment
- CVE-2024-32039 [Moderate] Integer overflow & OutOfBound Write in
  clear_decompress_residual_data
- CVE-2024-32040 [Low] integer underflow in nsc_rle_decode
- CVE-2024-32458 [Low] OutOfBound Read in planar_skip_plane_rle
- CVE-2024-32459 [Low] OutOfBound Read in ncrush_decompress
- CVE-2024-32460 [Low] OutOfBound Read in interleaved_decompress

https://github.com/FreeRDP/FreeRDP/releases/tag/2.11.6

Signed-off-by: Fabrice Fontaine <fontaine.fabrice@gmail.com>
Signed-off-by: Peter Korsgaard <peter@korsgaard.com>
(cherry picked from commit 1126be70ff)
Signed-off-by: Peter Korsgaard <peter@korsgaard.com>
2024-05-07 22:14:16 +02:00
Peter Korsgaard f357412f13 package/tinycbor: override prefix at build time as well
To ensure the correct prefix is used in the generated tinycbor.pc instead of
/usr/local:

>>> tinycbor 0.6.0 Building
..
sed > tinycbor.pc < tinycbor.pc.in \
        -e 's,@prefix@,/usr/local,' \
        -e 's,@exec_prefix@,/usr/local,' \
        -e 's,@libdir@,/usr/local/lib,' \
        -e 's,@includedir@,/usr/local/include,' \
        -e 's,@version@,0.6.0,'
>>> tinycbor 0.6.0 Installing to staging directory
..
install -m 644 tinycbor.pc /path/to/buildroot/output/host/aarch64-buildroot-linux-gnu/sysroot/usr/lib/pkgconfig/tinycbor.pc

Signed-off-by: Peter Korsgaard <peter@korsgaard.com>
(cherry picked from commit b059e08420)
Signed-off-by: Peter Korsgaard <peter@korsgaard.com>
2024-05-07 22:13:28 +02:00
Peter Korsgaard e83045c482 package/php: security bump version to 8.2.18
Fixes CVE-2024-1874, CVE-2024-2756 & CVE-2024-3096.

Changelog: https://www.php.net/ChangeLog-8.php#PHP_8_2
Release notes: https://news-web.php.net/php.announce/423

Signed-off-by: Peter Korsgaard <peter@korsgaard.com>
2024-05-07 22:03:21 +02:00
Fabrice Fontaine 5177d62dce package/python-pillow: fix legal info
Commit dfaa34ddd3 forgot to update hash of
LICENSE file:

ERROR: LICENSE has wrong sha256 hash:
ERROR: expected: e706384c6f299d1b6fa782ae657740b372b4bd7938a1a318bf94ac249114758a
ERROR: got     : cf234c27a3f275f5a050f4df3946f8855704226fe4e7ca8b33928cbcecbced37

LICENSE file has been updated to clean up authors and contributors:
https://github.com/python-pillow/Pillow/commit/4197263dff19a79f13cd86f6cdc9a0ec6c06da92

Fixes: dfaa34ddd3
 - http://autobuild.buildroot.org/results/5a35d83c73367e1b20534b1bc7f2f564cf653a38

Signed-off-by: Fabrice Fontaine <fontaine.fabrice@gmail.com>
Signed-off-by: Yann E. MORIN <yann.morin.1998@free.fr>
(cherry picked from commit b8a86f5a8f)
Signed-off-by: Peter Korsgaard <peter@korsgaard.com>
2024-05-07 18:11:07 +02:00
Angelo Compagnucci 30ce03a445 package/python-pillow: security bumo to version 10.3.0
In _imagingcms.c in Pillow before 10.3.0, a buffer overflow exists because
strcpy is used instead of strncpy.

Signed-off-by: Angelo Compagnucci <angelo.compagnucci@gmail.com>
Signed-off-by: Peter Korsgaard <peter@korsgaard.com>
(cherry picked from commit dfaa34ddd3)
Signed-off-by: Peter Korsgaard <peter@korsgaard.com>
2024-05-07 18:10:56 +02:00
Thomas Devoogdt 35e8608c4c .github: add a pull request warning that explains the mailing list workflow
Signed-off-by: Thomas Devoogdt <thomas@devoogdt.com>
Reviewed-by: J. Neuschäfer <j.neuschaefer@gmx.net>
Signed-off-by: Yann E. MORIN <yann.morin.1998@free.fr>
(cherry picked from commit 32753c6f9d)
Signed-off-by: Peter Korsgaard <peter@korsgaard.com>
2024-05-07 18:09:38 +02:00
Waldemar Brodkorb 95f301fe98 package/elf2flt: fix riscv64 noMMU build
Fixes:
https://gitlab.com/buildroot.org/buildroot/-/jobs/6655119961

Signed-off-by: Waldemar Brodkorb <wbx@openadk.org>
Signed-off-by: Romain Naour <romain.naour@smile.fr>
(cherry picked from commit 8d366dbf56)
Signed-off-by: Peter Korsgaard <peter@korsgaard.com>
2024-05-07 18:07:32 +02:00
TIAN Yuanhao c681f1dc7d package/ttyd: set CPE_ID_VALID
cpe:2.3:a:ttyd_project:ttyd is a valid CPE identifier for this package:

    https://nvd.nist.gov/products/cpe/detail/DBEDA75E-4E19-48C1-92D7-43E4035BC048

Signed-off-by: TIAN Yuanhao <tianyuanhao3@163.com>
[yann.morin.1998@free.fr: Move to its own patch]
Signed-off-by: Yann E. MORIN <yann.morin.1998@free.fr>
(cherry picked from commit 7d4ba7eaf9)
Signed-off-by: Peter Korsgaard <peter@korsgaard.com>
2024-05-07 18:00:39 +02:00
303 changed files with 2481 additions and 1447 deletions
+1 -5
View File
@@ -307,7 +307,6 @@ package/dmalloc/0004-Makefile-use-the-configure-detected-or-user-supplied.patch
package/dmalloc/0005-configure-use-LD-instead-of-hard-coding-ld.patch Upstream
package/dmraid/0001-fix-compilation-under-musl.patch Upstream
package/dmraid/S20dmraid Variables
package/dnsmasq/S80dnsmasq Shellcheck
package/docker-engine/S60dockerd Indent Shellcheck Variables
package/docopt-cpp/0001-only-build-one-target-use-BUILD_SHARED_LIBS-where-appropriate.patch Upstream
package/domoticz/S99domoticz Shellcheck
@@ -423,7 +422,7 @@ package/gamin/0003-fix-missing-PTHREAD_MUTEX_RECURSIVE_NP.patch Upstream
package/gcc/11.4.0/0001-or1k-Add-mcmodel-option-to-handle-large-GOTs.patch Upstream
package/gcc/11.4.0/0004-disable-split-stack-for-non-thread-builds.patch Upstream
package/gcc/12.3.0/0001-disable-split-stack-for-non-thread-builds.patch Upstream
package/gcc/13.2.0/0001-disable-split-stack-for-non-thread-builds.patch Upstream
package/gcc/13.3.0/0001-disable-split-stack-for-non-thread-builds.patch Upstream
package/gcc/8.4.0/0001-xtensa-fix-PR-target-91880.patch Upstream
package/gcc/8.4.0/0002-Revert-re-PR-target-92095-internal-error-with-O1-mcp.patch Upstream
package/gcc/8.4.0/0003-libsanitizer-Remove-cyclades-from-libsanitizer.patch Upstream
@@ -642,7 +641,6 @@ package/libloki/0001-allow-to-install-to-a-specific-location-using-DESTDI.patch
package/libloki/0002-use-ln-snf.patch Upstream
package/libmad/0001-mips-h-constraint-removal.patch Sob Upstream
package/libmad/0002-configure-ac-automake-foreign.patch Upstream
package/libmanette/0001-Meson-Un-hardcode-building-a-shared-library.patch Upstream
package/libmng/0001-jpeg-9a.patch Upstream
package/libmodsecurity/0001-configure.ac-drop-usage-of-git-at-configure-time.patch Upstream
package/libmodsecurity/0002-modsecurity.pc.in-add-lstdc.patch Upstream
@@ -1081,7 +1079,6 @@ package/python3/0028-fix-building-on-older-distributions.patch Upstream
package/python3/0029-configure.ac-fixup-CC-print-multiarch-output-for-mus.patch Upstream
package/python3/0030-Add-an-option-to-disable-the-berkeleydb-module.patch Upstream
package/python3/0031-lib-crypt-uClibc-ng-doesn-t-set-errno-when-encryptio.patch Upstream
package/qemu/0001-tests-fp-disable-fp-bench-build-by-default.patch Upstream
package/qemu/0002-softmmu-qemu-seccomp.c-add-missing-header-for-CLONE_.patch Upstream
package/qextserialport/0001-Create-a-main-include-file-QExtSerialPort.patch Upstream
package/qextserialport/0002-Tell-qmake-to-add-a-pkgconfig-file-to-ease-usage-wit.patch Upstream
@@ -1264,7 +1261,6 @@ package/tinyalsa/0001-include-time.h-before-asound.h.patch Upstream
package/tinycbor/0001-Makefile-add-DISABLE_WERROR.patch Upstream
package/tinycompress/0001-wave-add-time.h-missing-header-inclusion.patch Upstream
package/tinydtls/0001-sha2-sha2.c-fix-build-on-big-endian.patch Upstream
package/tinyproxy/0001-prevent-junk-from-showing-up-in-error-page-in-invalid-requests.patch Upstream
package/tinyxml/0001-In-stamp-always-advance-the-pointer-if-p-0xef.patch Upstream
package/tpm2-abrmd/S80tpm2-abrmd Indent Shellcheck Variables
package/tpm2-tss/0001-Temporary-fix-for-build-without-C.patch Upstream
+6
View File
@@ -0,0 +1,6 @@
Please do not submit a Pull Request via GitHub. Buildroot makes use of a
[mailing list](http://lists.buildroot.org/mailman/listinfo/buildroot) for patch submission and review.
See [submitting your own patches](http://buildroot.org/manual.html#submitting-patches) for more info.
Thanks for your help!
+58
View File
@@ -1,3 +1,61 @@
2024.02.3, released June 10th, 2024
Important / security related fixes.
Misc:
- Fixed a number of compilation issues for hosts using GCC
14.x, including for kconfig.
Download:
- Drop redundant --passive-ftp from default wget options and
migrate a number of packages using FTP upstreams to HTTP(S)
for compatibility with wget2 which does not have FTP support
- Ensure downloads are correctly shared for host packages that
try to do so using <pkg>_DL_SUBDIR and ensure the correct
toplevel directory name is used in generated tarballs when
downloads are shared.
Arch: Enable SSE2 support for x86 Pentium M variant.
Defconfigs: Orangepi PC/R1, Raspberrypi zero2w, Sipeed
licheepi nano, Wandboard: Fix compilation issues. PC x86-64
bios/efi: add wireless regdb to fix kernel warning during
boot, iMX.8 boards: Adjust FIT external data position to match
imx-mkimage changes, fixing boot issues.
Updated/fixed packages: am33x-cm, apcupsd,
arm-trusted-firmware, binutils-bare-metal, bpftool, catch2,
ccache, cjson, clamav, cog, coreutils, cryptodev-linux,
dhcpcd, dmraid, dnsmasq, docker-cli, docker-compose,
docker-engine, doom-wad, duma, elf2flt, ebtables, elfutils,
evemu, file, fluidsynth, freeradius-client, freeradius-server,
freerdp, fwts, gcc, gcc-bare-metal, git, gnuplot, go,
gr-osmosdr, gst1-plugins-good, hidapi, imagemagick,
intel-gmmlib, ivi-homescreen, janus-gateway, kexec, kmod,
kodi, libarchive, libdrm, libedit, libffi, libglib2, libhtp,
libjwt, libkrb5, libmanette, libmdbx, libmnl,
libnetfilter_acct, libnetfilter_log, libnpth, libopenssl,
libpng, libuhttpd, liburiparser, libutempter, libvncserver,
libwpe, lightning, linux-firmware, linux-pam, lua-cffi,
luajit, lvm2, lynx, mariadb, mesa3d, micropython, minisign,
musl, mutt, ncftp, network-manager, newlib-bare-metal, nfacct,
nfs-utils, octave, openjpeg, openocd, oprofile,
perl-dbd-mysql, php, postgresql, pppd, privoxy, procps-ng,
proftpd, proj, putty, python-ml-dtypes, python-pillow,
python-rds-py, qemu, qt5base, redis-plus-plus, rtl8189fs,
ruby, samba4, shadow, smcroute, speech, squid, sscep,
suricata, swupdate, systemd, ti-sgx-km, tinycbor, tinyproxy,
tor, tpm2-tss, ttyd, uboot-tools, ulogd, vala, weston,
wpewebkit, x11vnc, zbar, zeromq, zfs, zip, zxing-cpp
Issues resolved (http://bugs.uclibc.org):
#15766: BR2_PACKAGE_WESTON_XWAYLAND -- 12.0.1 -- fails to build..
#15973: imx8m bootloader image generation broken since update..
#16075: Cannot use linux kernel extensions from external tree..
#16093: kmod and gcc-14 build error
2024.02.2, released May 7th, 2024
Important / security related fixes.
+1 -1
View File
@@ -105,7 +105,7 @@ menu "Commands"
config BR2_WGET
string "Wget command"
default "wget --passive-ftp -nd -t 3"
default "wget -nd -t 3"
config BR2_SVN
string "Subversion (svn) command"
+20 -10
View File
@@ -114,6 +114,7 @@ F: package/libest/
N: Alexander Mukhin <alexander.i.mukhin@gmail.com>
F: package/tinyproxy/
F: package/zfs/
N: Alexander Sverdlin <alexander.sverdlin@gmail.com>
F: package/mini-snmpd/
@@ -530,10 +531,12 @@ F: package/ncdu/
N: Brandon Maier <brandon.maier@collins.com>
F: board/freescale/ls1046a-frwy/
F: configs/ls1046a-frwy_defconfig
F: package/mtd/
F: package/python-pysensors/
F: package/qoriq-fm-ucode/
F: package/unifdef/
F: package/vmtouch/
F: support/testing/tests/package/test_zip.py
N: Brock Williams <brock@cottonwoodcomputer.com>
F: package/pdmenu/
@@ -1489,7 +1492,7 @@ F: package/zip/
N: Jared Bents <jared.bents@rockwellcollins.com>
F: package/libvirt/
N: Jarkko Sakkinen <jarkko.sakkinen@intel.com>
N: Jarkko Sakkinen <jarkko@kernel.org>
F: package/quota/
N: Jason Pruitt <jrspruitt@gmail.com>
@@ -1772,23 +1775,29 @@ F: support/testing/tests/package/test_ddrescue.py
F: support/testing/tests/package/test_ddrescue/
F: support/testing/tests/package/test_dos2unix.py
F: support/testing/tests/package/test_ed.py
F: support/testing/tests/package/test_ethtool.py
F: support/testing/tests/package/test_ethtool/
F: support/testing/tests/package/test_file.py
F: support/testing/tests/package/test_file/
F: support/testing/tests/package/test_fluidsynth.py
F: support/testing/tests/package/test_fluidsynth/
F: support/testing/tests/package/test_fping.py
F: support/testing/tests/package/test_fwts.py
F: support/testing/tests/package/test_gawk.py
F: support/testing/tests/package/test_ghostscript.py
F: support/testing/tests/package/test_ghostscript/
F: support/testing/tests/package/test_glslsandbox_player.py
F: support/testing/tests/package/test_glslsandbox_player/
F: support/testing/tests/package/test_gnupg2.py
F: support/testing/tests/package/test_gnuplot.py
F: support/testing/tests/package/test_gnuplot/
F: support/testing/tests/package/test_gnuradio.py
F: support/testing/tests/package/test_gnuradio/
F: support/testing/tests/package/test_gzip.py
F: support/testing/tests/package/test_highway.py
F: support/testing/tests/package/test_hwloc.py
F: support/testing/tests/package/test_iozone.py
F: support/testing/tests/package/test_iperf.py
F: support/testing/tests/package/test_iperf3.py
F: support/testing/tests/package/test_iptables.py
F: support/testing/tests/package/test_jailhouse.py
@@ -1803,10 +1812,12 @@ F: support/testing/tests/package/test_libcamera.py
F: support/testing/tests/package/test_libcamera/
F: support/testing/tests/package/test_libgpgme.py
F: support/testing/tests/package/test_libjxl.py
F: support/testing/tests/package/test_links.py
F: support/testing/tests/package/test_links/
F: support/testing/tests/package/test_lrzip.py
F: support/testing/tests/package/test_lrzsz.py
F: support/testing/tests/package/test_ltrace.py
F: support/testing/tests/package/test_lvm2.py
F: support/testing/tests/package/test_lvm2/
F: support/testing/tests/package/test_lzip.py
F: support/testing/tests/package/test_lsof.py
F: support/testing/tests/package/test_lz4.py
@@ -1819,6 +1830,8 @@ F: support/testing/tests/package/test_mtools.py
F: support/testing/tests/package/test_mtr.py
F: support/testing/tests/package/test_ncdu.py
F: support/testing/tests/package/test_netcat.py
F: support/testing/tests/package/test_netsnmp.py
F: support/testing/tests/package/test_netsnmp/
F: support/testing/tests/package/test_nftables.py
F: support/testing/tests/package/test_nftables/
F: support/testing/tests/package/test_ngrep.py
@@ -1845,6 +1858,7 @@ F: support/testing/tests/package/test_rdma_core.py
F: support/testing/tests/package/test_rdma_core/
F: support/testing/tests/package/test_screen.py
F: support/testing/tests/package/test_sed.py
F: support/testing/tests/package/test_socat.py
F: support/testing/tests/package/test_sox.py
F: support/testing/tests/package/test_sqlite.py
F: support/testing/tests/package/test_strace.py
@@ -1863,6 +1877,7 @@ F: support/testing/tests/package/test_weston/
F: support/testing/tests/package/test_xz.py
F: support/testing/tests/package/test_z3.py
F: support/testing/tests/package/test_z3/
F: support/testing/tests/package/test_zbar.py
F: support/testing/tests/package/test_zchunk.py
F: support/testing/tests/package/test_zstd.py
@@ -2750,15 +2765,9 @@ F: support/misc/toolchainfile.cmake.in
N: Sam Voss <sam.voss@gmail.com>
F: package/ripgrep/
N: Sebastian Weyer <sebastian.weyer@smile.fr>
F: package/amlogic-boot-fip/
F: package/nushell/
F: package/rust-bindgen/
F: package/spirv-headers/
F: support/testing/tests/package/sample_nu.nu
F: support/testing/tests/package/test_nu.py
N: Sébastien Szymanski <sebastien.szymanski@armadeus.com>
F: board/armadeus/
F: configs/armadeus*
F: package/mmc-utils/
F: package/python-flask-jsonrpc/
F: package/python-flask-login/
@@ -3270,6 +3279,7 @@ F: package/libuci/
F: package/linux-firmware/
F: package/linux-serial-test/
F: package/modem-manager/
F: package/ncftp/
F: package/nftables/
F: package/nuttcp/
F: package/parted/
+2 -2
View File
@@ -90,9 +90,9 @@ all:
.PHONY: all
# Set and export the version string
export BR2_VERSION := 2024.02.2
export BR2_VERSION := 2024.02.3
# Actual time the release is cut (for reproducible builds)
BR2_VERSION_EPOCH = 1715067000
BR2_VERSION_EPOCH = 1718005000
# Save running make version since it's clobbered by the make package
RUNNING_MAKE_VERSION := $(MAKE_VERSION)
+1
View File
@@ -72,6 +72,7 @@ config BR2_x86_pentium_m
depends on !BR2_x86_64
select BR2_X86_CPU_HAS_MMX
select BR2_X86_CPU_HAS_SSE
select BR2_X86_CPU_HAS_SSE2
config BR2_x86_pentium2
bool "pentium2"
depends on !BR2_x86_64
@@ -0,0 +1,2 @@
# Locally calculated
sha256 cdc04cca9e811043efdea43ad203d70d897e23a8bd46f01896ba45c8df50f6ec at91bootstrap3-v3.10.3-br1.tar.gz
@@ -0,0 +1 @@
../linux/linux.hash
@@ -0,0 +1,2 @@
# Locally calculated
sha256 b66a5b863b0f8669448b74ca83bd641a856f164b29956e539bbcb5fdeeab9cc6 linux-6.6.30.tar.xz
@@ -8,6 +8,8 @@ main ()
exit 1
fi
FIT_EXTERNAL_POSITION=0x5000
if grep -Eq "^BR2_PACKAGE_FREESCALE_IMX_PLATFORM_IMX8M=y$" ${BR2_CONFIG}; then
dd if=${BINARIES_DIR}/u-boot-spl.bin of=${BINARIES_DIR}/u-boot-spl-padded.bin bs=4 conv=sync
cat ${BINARIES_DIR}/u-boot-spl-padded.bin ${BINARIES_DIR}/ddr_fw.bin > ${BINARIES_DIR}/u-boot-spl-ddr.bin
@@ -16,7 +18,7 @@ main ()
else
BL31=${BINARIES_DIR}/bl31.bin BL33=${BINARIES_DIR}/u-boot-nodtb.bin ATF_LOAD_ADDR=0x00910000 ${HOST_DIR}/bin/mkimage_fit_atf.sh ${UBOOT_DTB} > ${BINARIES_DIR}/u-boot.its
fi
${HOST_DIR}/bin/mkimage -E -p 0x3000 -f ${BINARIES_DIR}/u-boot.its ${BINARIES_DIR}/u-boot.itb
${HOST_DIR}/bin/mkimage -E -p ${FIT_EXTERNAL_POSITION} -f ${BINARIES_DIR}/u-boot.its ${BINARIES_DIR}/u-boot.itb
rm -f ${BINARIES_DIR}/u-boot.its
${HOST_DIR}/bin/mkimage_imx8 -fit -signed_hdmi ${BINARIES_DIR}/signed_hdmi_imx8m.bin -loader ${BINARIES_DIR}/u-boot-spl-ddr.bin 0x7E1000 -second_loader ${BINARIES_DIR}/u-boot.itb 0x40200000 0x60000 -out ${BINARIES_DIR}/imx8-boot-sd.bin
@@ -28,7 +30,7 @@ main ()
else
BL31=${BINARIES_DIR}/bl31.bin BL33=${BINARIES_DIR}/u-boot-nodtb.bin ATF_LOAD_ADDR=0x00920000 ${HOST_DIR}/bin/mkimage_fit_atf.sh ${UBOOT_DTB} > ${BINARIES_DIR}/u-boot.its
fi
${HOST_DIR}/bin/mkimage -E -p 0x3000 -f ${BINARIES_DIR}/u-boot.its ${BINARIES_DIR}/u-boot.itb
${HOST_DIR}/bin/mkimage -E -p ${FIT_EXTERNAL_POSITION} -f ${BINARIES_DIR}/u-boot.its ${BINARIES_DIR}/u-boot.itb
rm -f ${BINARIES_DIR}/u-boot.its
${HOST_DIR}/bin/mkimage_imx8 -fit -loader ${BINARIES_DIR}/u-boot-spl-ddr.bin 0x7E1000 -second_loader ${BINARIES_DIR}/u-boot.itb 0x40200000 0x60000 -out ${BINARIES_DIR}/imx8-boot-sd.bin
@@ -40,7 +42,7 @@ main ()
else
BL31=${BINARIES_DIR}/bl31.bin BL33=${BINARIES_DIR}/u-boot-nodtb.bin ATF_LOAD_ADDR=0x00960000 ${HOST_DIR}/bin/mkimage_fit_atf.sh ${UBOOT_DTB} > ${BINARIES_DIR}/u-boot.its
fi
${HOST_DIR}/bin/mkimage -E -p 0x3000 -f ${BINARIES_DIR}/u-boot.its ${BINARIES_DIR}/u-boot.itb
${HOST_DIR}/bin/mkimage -E -p ${FIT_EXTERNAL_POSITION} -f ${BINARIES_DIR}/u-boot.its ${BINARIES_DIR}/u-boot.itb
rm -f ${BINARIES_DIR}/u-boot.its
${HOST_DIR}/bin/mkimage_imx8 -v v2 -fit -loader ${BINARIES_DIR}/u-boot-spl-ddr.bin 0x912000 -second_loader ${BINARIES_DIR}/u-boot.itb 0x40200000 0x60000 -out ${BINARIES_DIR}/imx8-boot-sd.bin
@@ -52,7 +54,7 @@ main ()
else
BL31=${BINARIES_DIR}/bl31.bin BL33=${BINARIES_DIR}/u-boot-nodtb.bin ATF_LOAD_ADDR=0x00970000 ${HOST_DIR}/bin/mkimage_fit_atf.sh ${UBOOT_DTB} > ${BINARIES_DIR}/u-boot.its
fi
${HOST_DIR}/bin/mkimage -E -p 0x3000 -f ${BINARIES_DIR}/u-boot.its ${BINARIES_DIR}/u-boot.itb
${HOST_DIR}/bin/mkimage -E -p ${FIT_EXTERNAL_POSITION} -f ${BINARIES_DIR}/u-boot.its ${BINARIES_DIR}/u-boot.itb
rm -f ${BINARIES_DIR}/u-boot.its
${HOST_DIR}/bin/mkimage_imx8 -v v2 -fit -loader ${BINARIES_DIR}/u-boot-spl-ddr.bin 0x920000 -second_loader ${BINARIES_DIR}/u-boot.itb 0x40200000 0x60000 -out ${BINARIES_DIR}/imx8-boot-sd.bin
@@ -0,0 +1 @@
../linux/linux.hash
@@ -0,0 +1,2 @@
# Locally calculated
sha256 0820fdb7971c6974338081c11fbf2dc869870501e7bdcac4d0ed58ba1f57b61c linux-4.14.336.tar.xz
@@ -0,0 +1,2 @@
# Locally calculated
sha256 9f10df88bc91b35642e461217f73256bbaeeca9ae2db8db56197ba5e89e1f6d4 u-boot-2018.07.tar.bz2
@@ -59,6 +59,7 @@ endif
endif
ARM_TRUSTED_FIRMWARE_MAKE_OPTS += \
$(if $(VERBOSE),V=1) \
CROSS_COMPILE="$(TARGET_CROSS)" \
BUILD_STRING=$(ARM_TRUSTED_FIRMWARE_VERSION) \
$(call qstrip,$(BR2_TARGET_ARM_TRUSTED_FIRMWARE_ADDITIONAL_VARIABLES)) \
+2 -2
View File
@@ -76,7 +76,7 @@ config BR2_TARGET_BAREBOX_CUSTOM_GIT_VERSION
endif
source boot/barebox/barebox/Config.in
source "boot/barebox/barebox/Config.in"
menuconfig BR2_TARGET_BAREBOX_AUX
bool "Build barebox with an auxiliary config"
@@ -90,7 +90,7 @@ menuconfig BR2_TARGET_BAREBOX_AUX
if BR2_TARGET_BAREBOX_AUX
source boot/barebox/barebox-aux/Config.in
source "boot/barebox/barebox-aux/Config.in"
endif
+3 -1
View File
@@ -3,12 +3,14 @@ BR2_cortex_a5=y
BR2_ARM_ENABLE_VFP=y
BR2_ARM_INSTRUCTIONS_THUMB2=y
BR2_PACKAGE_HOST_LINUX_HEADERS_CUSTOM_6_6=y
BR2_GLOBAL_PATCH_DIR="board/acmesystems/acqua-a5/patches"
BR2_DOWNLOAD_FORCE_CHECK_HASHES=y
BR2_SYSTEM_DHCP="eth0"
BR2_ROOTFS_POST_IMAGE_SCRIPT="support/scripts/genimage.sh"
BR2_ROOTFS_POST_SCRIPT_ARGS="-c board/acmesystems/acqua-a5/genimage.cfg"
BR2_LINUX_KERNEL=y
BR2_LINUX_KERNEL_CUSTOM_VERSION=y
BR2_LINUX_KERNEL_CUSTOM_VERSION_VALUE="6.6.12"
BR2_LINUX_KERNEL_CUSTOM_VERSION_VALUE="6.6.30"
BR2_LINUX_KERNEL_DEFCONFIG="sama5"
BR2_LINUX_KERNEL_DTS_SUPPORT=y
BR2_LINUX_KERNEL_CUSTOM_DTS_PATH="board/acmesystems/acqua-a5/at91-sama5d3_acqua.dts"
+3 -1
View File
@@ -3,12 +3,14 @@ BR2_cortex_a5=y
BR2_ARM_ENABLE_VFP=y
BR2_ARM_INSTRUCTIONS_THUMB2=y
BR2_PACKAGE_HOST_LINUX_HEADERS_CUSTOM_6_6=y
BR2_GLOBAL_PATCH_DIR="board/acmesystems/acqua-a5/patches"
BR2_DOWNLOAD_FORCE_CHECK_HASHES=y
BR2_SYSTEM_DHCP="eth0"
BR2_ROOTFS_POST_IMAGE_SCRIPT="support/scripts/genimage.sh"
BR2_ROOTFS_POST_SCRIPT_ARGS="-c board/acmesystems/acqua-a5/genimage.cfg"
BR2_LINUX_KERNEL=y
BR2_LINUX_KERNEL_CUSTOM_VERSION=y
BR2_LINUX_KERNEL_CUSTOM_VERSION_VALUE="6.6.12"
BR2_LINUX_KERNEL_CUSTOM_VERSION_VALUE="6.6.30"
BR2_LINUX_KERNEL_DEFCONFIG="sama5"
BR2_LINUX_KERNEL_DTS_SUPPORT=y
BR2_LINUX_KERNEL_CUSTOM_DTS_PATH="board/acmesystems/acqua-a5/at91-sama5d3_acqua.dts"
+1 -1
View File
@@ -23,7 +23,7 @@ BR2_TARGET_UBOOT_SPL_NAME="spl/u-boot-spl-dtb.bin tpl/u-boot-tpl.bin"
# Kernel
BR2_LINUX_KERNEL=y
BR2_LINUX_KERNEL_CUSTOM_VERSION=y
BR2_LINUX_KERNEL_CUSTOM_VERSION_VALUE="6.1.72"
BR2_LINUX_KERNEL_CUSTOM_VERSION_VALUE="6.1.79"
BR2_LINUX_KERNEL_DEFCONFIG="multi_v7"
BR2_LINUX_KERNEL_DTS_SUPPORT=y
BR2_LINUX_KERNEL_INTREE_DTS_NAME="rk3288-tinker-s"
+2 -1
View File
@@ -22,11 +22,12 @@ BR2_TARGET_ROOTFS_EXT2_4=y
BR2_TARGET_UBOOT=y
BR2_TARGET_UBOOT_BUILD_SYSTEM_KCONFIG=y
BR2_TARGET_UBOOT_CUSTOM_VERSION=y
BR2_TARGET_UBOOT_CUSTOM_VERSION_VALUE="2020.10"
BR2_TARGET_UBOOT_CUSTOM_VERSION_VALUE="2024.01"
BR2_TARGET_UBOOT_BOARD_DEFCONFIG="orangepi_pc"
BR2_TARGET_UBOOT_NEEDS_DTC=y
BR2_TARGET_UBOOT_NEEDS_PYTHON3=y
BR2_TARGET_UBOOT_NEEDS_PYLIBFDT=y
BR2_TARGET_UBOOT_NEEDS_OPENSSL=y
BR2_TARGET_UBOOT_FORMAT_CUSTOM=y
BR2_TARGET_UBOOT_FORMAT_CUSTOM_NAME="u-boot-sunxi-with-spl.bin"
BR2_PACKAGE_HOST_GENIMAGE=y
+4 -4
View File
@@ -19,20 +19,20 @@ BR2_TARGET_ROOTFS_EXT2_4=y
BR2_TARGET_UBOOT=y
BR2_TARGET_UBOOT_BUILD_SYSTEM_KCONFIG=y
BR2_TARGET_UBOOT_CUSTOM_VERSION=y
BR2_TARGET_UBOOT_CUSTOM_VERSION_VALUE="2020.10"
BR2_TARGET_UBOOT_CUSTOM_VERSION_VALUE="2024.01"
BR2_TARGET_UBOOT_BOARD_DEFCONFIG="orangepi_r1"
BR2_TARGET_UBOOT_NEEDS_DTC=y
BR2_TARGET_UBOOT_NEEDS_PYTHON3=y
BR2_TARGET_UBOOT_NEEDS_PYLIBFDT=y
BR2_TARGET_UBOOT_NEEDS_OPENSSL=y
BR2_TARGET_UBOOT_FORMAT_CUSTOM=y
BR2_TARGET_UBOOT_FORMAT_CUSTOM_NAME="u-boot-sunxi-with-spl.bin"
BR2_PACKAGE_HOST_UBOOT_TOOLS=y
BR2_PACKAGE_HOST_UBOOT_TOOLS_BOOT_SCRIPT=y
BR2_PACKAGE_HOST_UBOOT_TOOLS_BOOT_SCRIPT_SOURCE="board/orangepi/orangepi-r1/boot.cmd"
BR2_PACKAGE_HOST_DOSFSTOOLS=y
BR2_PACKAGE_HOST_GENIMAGE=y
BR2_PACKAGE_HOST_MTOOLS=y
BR2_PACKAGE_HOST_UBOOT_TOOLS=y
BR2_PACKAGE_HOST_UBOOT_TOOLS_BOOT_SCRIPT=y
BR2_PACKAGE_HOST_UBOOT_TOOLS_BOOT_SCRIPT_SOURCE="board/orangepi/orangepi-r1/boot.cmd"
BR2_ROOTFS_POST_IMAGE_SCRIPT="support/scripts/genimage.sh"
BR2_ROOTFS_POST_SCRIPT_ARGS="-c board/orangepi/orangepi-r1/genimage.cfg"
+1
View File
@@ -62,3 +62,4 @@ BR2_PACKAGE_ACPID=y
BR2_PACKAGE_CONNMAN=y
BR2_PACKAGE_CONNMAN_CLIENT=y
BR2_PACKAGE_CONNMAN_WIFI=y
BR2_PACKAGE_WIRELESS_REGDB=y
+1
View File
@@ -63,3 +63,4 @@ BR2_PACKAGE_ACPID=y
BR2_PACKAGE_CONNMAN=y
BR2_PACKAGE_CONNMAN_CLIENT=y
BR2_PACKAGE_CONNMAN_WIFI=y
BR2_PACKAGE_WIRELESS_REGDB=y
+1 -1
View File
@@ -3,7 +3,7 @@ BR2_cortex_a53=y
BR2_ARM_FPU_NEON_VFPV4=y
# Linux headers same as kernel, 6.1 series
BR2_PACKAGE_HOST_LINUX_HEADERS_CUSTOM_6.1=y
BR2_PACKAGE_HOST_LINUX_HEADERS_CUSTOM_6_1=y
BR2_TOOLCHAIN_BUILDROOT_CXX=y
-1
View File
@@ -14,7 +14,6 @@ BR2_LINUX_KERNEL_CUSTOM_REPO_URL="https://github.com/radxa/kernel.git"
BR2_LINUX_KERNEL_CUSTOM_REPO_VERSION="52f51a2b5ba178f331af62260d2da86d7472c14b"
BR2_LINUX_KERNEL_DEFCONFIG="rockchip_linux"
BR2_LINUX_KERNEL_DTS_SUPPORT=y
# BR2_LINUX_KERNEL_INTREE_DTS_NAME is not set
BR2_LINUX_KERNEL_CUSTOM_DTS_PATH="board/radxa/rock5b/rock5b.dts"
BR2_LINUX_KERNEL_DTB_OVERLAY_SUPPORT=y
BR2_LINUX_KERNEL_CONFIG_FRAGMENT_FILES="board/radxa/rock5b/linux.fragment"
+2 -1
View File
@@ -4,6 +4,7 @@ BR2_arm926t=y
# system
BR2_GLOBAL_PATCH_DIR="board/sheevaplug/patches"
BR2_DOWNLOAD_FORCE_CHECK_HASHES=y
BR2_TARGET_GENERIC_GETTY=y
BR2_TARGET_GENERIC_GETTY_PORT="ttyS0"
BR2_SYSTEM_DHCP="eth0"
@@ -27,7 +28,7 @@ BR2_TARGET_UBOOT_FORMAT_KWB=y
# Kernel
BR2_LINUX_KERNEL=y
BR2_LINUX_KERNEL_CUSTOM_VERSION=y
BR2_LINUX_KERNEL_CUSTOM_VERSION_VALUE="4.14.253"
BR2_LINUX_KERNEL_CUSTOM_VERSION_VALUE="4.14.336"
BR2_LINUX_KERNEL_DEFCONFIG="mvebu_v5"
BR2_LINUX_KERNEL_APPENDED_UIMAGE=y
BR2_LINUX_KERNEL_UIMAGE_LOADADDR="0x8000"
+3
View File
@@ -9,6 +9,9 @@ BR2_TARGET_GENERIC_GETTY_BAUDRATE_115200=y
BR2_ROOTFS_POST_IMAGE_SCRIPT="support/scripts/genimage.sh"
BR2_ROOTFS_POST_SCRIPT_ARGS="-c board/sipeed/licheepi_nano/genimage.cfg"
# Linux headers same as kernel
BR2_PACKAGE_HOST_LINUX_HEADERS_CUSTOM_6_5=y
# Kernel
BR2_LINUX_KERNEL=y
BR2_LINUX_KERNEL_CUSTOM_VERSION=y
+1
View File
@@ -26,6 +26,7 @@ BR2_TARGET_UBOOT_CUSTOM_VERSION=y
BR2_TARGET_UBOOT_CUSTOM_VERSION_VALUE="2024.01"
BR2_TARGET_UBOOT_BOARD_DEFCONFIG="wandboard"
BR2_TARGET_UBOOT_FORMAT_IMG=y
BR2_TARGET_UBOOT_NEEDS_OPENSSL=y
BR2_TARGET_UBOOT_SPL=y
BR2_TARGET_UBOOT_SPL_NAME="SPL"
+3
View File
@@ -96,3 +96,6 @@ corresponding tool on the host system:
* Graph generation tools:
** +graphviz+ to use 'graph-depends' and '<pkg>-graph-depends'
** +python-matplotlib+ to use 'graph-build'
* Package statistics tools ('pkg-stats'):
** +python-aiohttp+
+2 -2
View File
@@ -133,14 +133,14 @@
<div class="row">
<div class="col-sm-6">
<div class="panel panel-primary">
<div class="panel-heading"><a href="http://git.buildroot.net/buildroot"><h5>Recent commits</h5></a></div>
<div class="panel-heading"><a href="https://gitlab.com/buildroot.org/buildroot/"><h5>Recent commits</h5></a></div>
<div class="panel-box panel-body ellipsis" id="commit-activity">
</div>
</div>
</div>
<div class="col-sm-6" >
<div class="panel panel-primary">
<div class="panel-heading"><a href="http://dir.gmane.org/gmane.comp.lib.uclibc.buildroot"><h5>Recent discussions</h5></a></div>
<div class="panel-heading"><a href="https://lore.kernel.org/buildroot/"><h5>Recent discussions</h5></a></div>
<div class="panel-box panel-body ellipsis" id="mailing-list-activity">
</div>
</div>
+1 -1
View File
@@ -128,7 +128,7 @@ endif
config BR2_LINUX_KERNEL_VERSION
string
default "6.6.22" if BR2_LINUX_KERNEL_LATEST_VERSION
default "6.6.32" if BR2_LINUX_KERNEL_LATEST_VERSION
default "5.10.162-cip24" if BR2_LINUX_KERNEL_LATEST_CIP_VERSION
default "5.10.162-cip24-rt10" if BR2_LINUX_KERNEL_LATEST_CIP_RT_VERSION
default BR2_LINUX_KERNEL_CUSTOM_VERSION_VALUE \
+6 -6
View File
@@ -1,12 +1,12 @@
# From https://www.kernel.org/pub/linux/kernel/v6.x/sha256sums.asc
sha256 23e3e7b56407250f5411bdab95763d0bc4e3a19dfa431d951df7eacabd61a2f4 linux-6.6.22.tar.xz
sha256 d150d2d9d416877668d8b56f75759f166168d192419eefaa942ed67225cbec06 linux-6.1.82.tar.xz
sha256 aaa824eaf07f61911d22b75ff090a403c3dd0bd73e23933e0bba8b5971436ce1 linux-6.6.32.tar.xz
sha256 9019f427bfdc9ced5bc954d760d37ac08c0cdffb45ad28087fc45a73e64336c9 linux-6.1.92.tar.xz
# From https://www.kernel.org/pub/linux/kernel/v5.x/sha256sums.asc
sha256 f0805225f4a5b24d0bba9302c2c2f261c04f737ac5dd931da9b112e9f3e4a47e linux-5.15.152.tar.xz
sha256 84cf30223239ec3333a5f7b2a7fba2042bba70d1582a139f7543956af871ad80 linux-5.10.213.tar.xz
sha256 3599d5959a403e64be407d7f05e56cb270d6ddd154e89a596609919ab1e2e366 linux-5.4.272.tar.xz
sha256 f41e718e33b88f269a6b6a7653e5e9824c4ba541f6ffe5bf26ecc37c540a1b05 linux-5.15.160.tar.xz
sha256 9c36b243e8c3ec1d5963366618f336710b84340bf95be2037b26c452392cb2d6 linux-5.10.218.tar.xz
sha256 7e1f5b28588e49ddfd18e7772476e4e8b52bdc9c3e19beafcbb7c103e6c01f51 linux-5.4.277.tar.xz
# From https://www.kernel.org/pub/linux/kernel/v4.x/sha256sums.asc
sha256 95ec94c4ab8f46d8a54430893f9bd653c46b0f1587d216818aa8f52fd313de69 linux-4.19.310.tar.xz
sha256 6c5e4d3c87feadbfdb9f7d2e46f3f120b00286ba380491c5956708e0b94232c8 linux-4.19.315.tar.xz
# Locally computed
sha256 fb0edc3c18e47d2b6974cb0880a0afb5c3fa08f50ee87dfdf24349405ea5f8ae linux-cip-5.10.162-cip24.tar.gz
sha256 b5539243f187e3d478d76d44ae13aab83952c94b885ad889df6fa9997e16a441 linux-cip-5.10.162-cip24-rt10.tar.gz
+1 -1
View File
@@ -6,7 +6,7 @@
# This should correpsond to v05.00.00.02
AM33X_CM3_VERSION = 11107db2f1e9e58ee75d4fe9cc38423c9a6e4365
AM33X_CM3_SITE = http://arago-project.org/git/projects/am33x-cm3.git
AM33X_CM3_SITE = https://github.com/RobertCNelson/am33x-cm3
AM33X_CM3_SITE_METHOD = git
AM33X_CM3_LICENSE = TI Publicly Available Software License
AM33X_CM3_LICENSE_FILES = License.txt
+1
View File
@@ -11,6 +11,7 @@ APCUPSD_LICENSE_FILES = COPYING
APCUPSD_CPE_ID_VENDOR = apcupsd
APCUPSD_SELINUX_MODULES = apache apcupsd
APCUPSD_CONF_OPTS = --disable-test
APCUPSD_CONF_ENV = ac_cv_path_SHUTDOWN=/sbin/shutdown
ifneq ($(BR2_PACKAGE_APCUPSD_MODBUS_USB)$(BR2_PACKAGE_APCUPSD_USB),)
APCUPSD_CONF_ENV += ac_cv_path_usbcfg=$(STAGING_DIR)/usr/bin/libusb-config
@@ -11,6 +11,7 @@ HOST_BINUTILS_BARE_METAL_SOURCE = binutils-$(HOST_BINUTILS_BARE_METAL_VERSION).t
HOST_BINUTILS_BARE_METAL_LICENSE = GPL-3.0+, libiberty LGPL-2.1+
HOST_BINUTILS_BARE_METAL_LICENSE_FILES = COPYING3 COPYING.LIB
HOST_BINUTILS_BARE_METAL_CPE_ID_VENDOR = gnu
HOST_BINUTILS_BARE_METAL_CPE_ID_PRODUCT = binutils
HOST_BINUTILS_BARE_METAL_DEPENDENCIES = host-zlib
+1
View File
@@ -5,6 +5,7 @@ config BR2_PACKAGE_BPFTOOL_ARCH_SUPPORTS
default y if BR2_arm || BR2_armeb
default y if BR2_aarch64 || BR2_aarch64_be
default y if BR2_i386 || BR2_x86_64
default y if BR2_riscv
default y if BR2_sparc || BR2_sparc64
default y if BR2_s390x
+1 -1
View File
@@ -1,3 +1,3 @@
# Locally computed:
sha256 269543a49eb76f40b3f93ff231d4c24c27a7e16c90e47d2e45bcc564de470c6e catch2-3.5.2.tar.gz
sha256 b7754b711242c167d8f60b890695347f90a1ebc95949a045385114165d606dbb catch2-3.5.4.tar.gz
sha256 c9bff75738922193e67fa726fa225535870d2aa1059f91452c411736284ad566 LICENSE.txt
+1 -1
View File
@@ -4,7 +4,7 @@
#
################################################################################
CATCH2_VERSION = 3.5.2
CATCH2_VERSION = 3.5.4
CATCH2_SITE = $(call github,catchorg,Catch2,v$(CATCH2_VERSION))
CATCH2_INSTALL_STAGING = YES
CATCH2_INSTALL_TARGET = NO
+1
View File
@@ -15,6 +15,7 @@ HOST_CCACHE_DEPENDENCIES = host-hiredis host-zstd
HOST_CCACHE_CONF_OPTS += \
-UCMAKE_C_COMPILER_LAUNCHER \
-UCMAKE_CXX_COMPILER_LAUNCHER \
-DCCACHE_DEV_MODE=OFF \
-DZSTD_FROM_INTERNET=OFF \
-DHIREDIS_FROM_INTERNET=OFF \
-DENABLE_TESTING=OFF
+1 -1
View File
@@ -1,3 +1,3 @@
# Locally computed:
sha256 c91d1eeb7175c50d49f6ba2a25e69b46bd05cffb798382c19bfb202e467ec51c cjson-1.7.17.tar.gz
sha256 3aa806844a03442c00769b83e99970be70fbef03735ff898f4811dd03b9f5ee5 cjson-1.7.18.tar.gz
sha256 a36dda207c36db5818729c54e7ad4e8b0c6fba847491ba64f372c1a2037b6d5c LICENSE
+1 -1
View File
@@ -4,7 +4,7 @@
#
################################################################################
CJSON_VERSION = 1.7.17
CJSON_VERSION = 1.7.18
CJSON_SITE = $(call github,DaveGamble,cjson,v$(CJSON_VERSION))
CJSON_INSTALL_STAGING = YES
CJSON_LICENSE = MIT
+1 -1
View File
@@ -1,5 +1,5 @@
# Locally calculated
sha256 aa67ee9679f747af3c492353d768464c27d614b3fed62eb7f988b6776d4aedbb clamav-1.0.5.tar.gz
sha256 12dcd842b6c46e5a9fdf2f5c16304efafe53310ac4605990465651b0c42227b2 clamav-1.0.6.tar.gz
sha256 0c4fd2fa9733fc9122503797648710851e4ee6d9e4969dd33fcbd8c63cd2f584 COPYING.txt
sha256 d72a145c90918184a05ef65a04c9e6f7466faa59bc1b82c8f6a8ddc7ddcb9bed COPYING/COPYING.bzip2
sha256 dfb818a0d41411c6fb1c193c68b73018ceadd1994bda41ad541cbff292894bc6 COPYING/COPYING.file
+1 -1
View File
@@ -4,7 +4,7 @@
#
################################################################################
CLAMAV_VERSION = 1.0.5
CLAMAV_VERSION = 1.0.6
CLAMAV_SITE = https://www.clamav.net/downloads/production
CLAMAV_LICENSE = GPL-2.0
CLAMAV_LICENSE_FILES = \
+5
View File
@@ -47,10 +47,15 @@ config BR2_HOST_CMAKE_AT_LEAST_3_27
bool
select BR2_HOST_CMAKE_AT_LEAST_3_26
config BR2_HOST_CMAKE_AT_LEAST_3_28
bool
select BR2_HOST_CMAKE_AT_LEAST_3_27
# This order guarantees that the highest version is set, as kconfig
# stops affecting a value on the first matching default.
config BR2_HOST_CMAKE_AT_LEAST
string
default "3.28" if BR2_HOST_CMAKE_AT_LEAST_3_28
default "3.27" if BR2_HOST_CMAKE_AT_LEAST_3_27
default "3.26" if BR2_HOST_CMAKE_AT_LEAST_3_26
default "3.25" if BR2_HOST_CMAKE_AT_LEAST_3_25
+1 -1
View File
@@ -1,5 +1,5 @@
config BR2_PACKAGE_CMOCKA
bool cmocka
bool "cmocka"
depends on !BR2_STATIC_LIBS
help
cmocka is an elegant unit testing framework for C with support
+4 -4
View File
@@ -1,7 +1,7 @@
# From https://wpewebkit.org/releases/cog-0.18.2.tar.xz.sums
md5 7fbfc2e19304132be0d73f5e5512151c cog-0.18.2.tar.xz
sha1 045294f7fa878db86e4b8a617ee4ac056a71cb75 cog-0.18.2.tar.xz
sha256 3c4237cff6323b8c3eaf52c6f3f6415b898a22c0127c6c396c1eaa6eef46c279 cog-0.18.2.tar.xz
# From https://wpewebkit.org/releases/cog-0.18.4.tar.xz.sums
md5 0566ab6676b499ebcff372fbe39e24fc cog-0.18.4.tar.xz
sha1 2d6f88cfb07eaac1be2bf9954832f19f8a856631 cog-0.18.4.tar.xz
sha256 31d7079db2eeed790899d2f1f824dd6a54bf30d072d196d737be572f105d99b1 cog-0.18.4.tar.xz
# Hashes for license files:
sha256 e6c42d93c68b292bcccf6d2ec3e13da85df90b718ba27c2c2a01053a9d009252 COPYING
+1 -1
View File
@@ -4,7 +4,7 @@
#
################################################################################
COG_VERSION = 0.18.2
COG_VERSION = 0.18.4
COG_SITE = https://wpewebkit.org/releases
COG_SOURCE = cog-$(COG_VERSION).tar.xz
COG_INSTALL_STAGING = YES
-6
View File
@@ -75,12 +75,6 @@ ifeq ($(BR2_PACKAGE_GETTEXT_PROVIDES_LIBINTL),y)
COREUTILS_CONF_OPTS += --with-libintl-prefix=$(STAGING_DIR)/usr
endif
ifeq ($(BR2_PACKAGE_GMP),y)
COREUTILS_DEPENDENCIES += gmp
else
COREUTILS_CONF_OPTS += --without-gmp
endif
ifeq ($(BR2_PACKAGE_LIBCAP),y)
COREUTILS_DEPENDENCIES += libcap
else
@@ -0,0 +1,38 @@
From 5e7121e45ff283d30097da381fd7e97c4bb61364 Mon Sep 17 00:00:00 2001
From: =?UTF-8?q?Joan=20Bruguera=20Mic=C3=B3?= <joanbrugueram@gmail.com>
Date: Sun, 10 Dec 2023 13:57:55 +0000
Subject: [PATCH] Fix build for Linux 6.7-rc1
MIME-Version: 1.0
Content-Type: text/plain; charset=UTF-8
Content-Transfer-Encoding: 8bit
Since Linux 6.7-rc1, no ahash algorithms set a nonzero alignmask,
and therefore `crypto_ahash_alignmask` has been removed.
See also: https://git.kernel.org/pub/scm/linux/kernel/git/torvalds/linux.git/commit/?id=0f8660c82b79af595b056f6b9f4f227edeb88574
https://git.kernel.org/pub/scm/linux/kernel/git/torvalds/linux.git/commit/?id=c626910f3f1bbce6ad18bc613d895d2a089ed95e
Signed-off-by: Joan Bruguera Micó <joanbrugueram@gmail.com>
Upstream: https://github.com/cryptodev-linux/cryptodev-linux/commit/5e7121e45ff283d30097da381fd7e97c4bb61364
Signed-off-by: Fabrice Fontaine <fontaine.fabrice@gmail.com>
---
cryptlib.c | 4 ++++
1 file changed, 4 insertions(+)
diff --git a/cryptlib.c b/cryptlib.c
index 4d739e5..0e59d4c 100644
--- a/cryptlib.c
+++ b/cryptlib.c
@@ -381,7 +381,11 @@ int cryptodev_hash_init(struct hash_data *hdata, const char *alg_name,
}
hdata->digestsize = crypto_ahash_digestsize(hdata->async.s);
+#if (LINUX_VERSION_CODE < KERNEL_VERSION(6, 7, 0))
hdata->alignmask = crypto_ahash_alignmask(hdata->async.s);
+#else
+ hdata->alignmask = 0;
+#endif
init_completion(&hdata->async.result.completion);
+2 -2
View File
@@ -1,4 +1,4 @@
# sha256 from https://github.com/NetworkConfiguration/dhcpcd/releases/tag/v10.0.4
sha256 eb1f3cfef3069781ff8c896d7cea922639964afe22db28c069dc3f37f57eb428 dhcpcd-10.0.5.tar.xz
# sha256 from https://github.com/NetworkConfiguration/dhcpcd/releases/tag/v10.0.8
sha256 d8dddf9f971a8d9ff828f33d8fa9f6d9a892a4a1429d230e9efb2be97dd0e313 dhcpcd-10.0.8.tar.xz
# Locally calculated
sha256 a7d6da3a202cdd38eaab0bcea4d25f60d002980f3785b3e896d9bf387f093ac8 LICENSE
+1 -1
View File
@@ -4,7 +4,7 @@
#
################################################################################
DHCPCD_VERSION = 10.0.5
DHCPCD_VERSION = 10.0.8
DHCPCD_SOURCE = dhcpcd-$(DHCPCD_VERSION).tar.xz
DHCPCD_SITE = https://github.com/NetworkConfiguration/dhcpcd/releases/download/v$(DHCPCD_VERSION)
DHCPCD_DEPENDENCIES = host-pkgconf
+1 -1
View File
@@ -13,7 +13,7 @@ DMRAID_MAKE = $(MAKE1)
DMRAID_INSTALL_STAGING = YES
DMRAID_LICENSE = GPL-2.0
DMRAID_LICENSE_FILES = $(DMRAID_SUBDIR)/LICENSE_GPL $(DMRAID_SUBDIR)/LICENSE
DMRAID_MAKE_OPTS = $(TARGET_CONFIGURE_OPTS)
DMRAID_MAKE_OPTS = $(TARGET_CONFIGURE_OPTS) CFLAGS="$(TARGET_CFLAGS) -fPIC"
DMRAID_DEPENDENCIES = lvm2
+9
View File
@@ -10,12 +10,21 @@ case "$1" in
printf "Starting dnsmasq: "
start-stop-daemon -S -p "$PIDFILE" -x "/usr/sbin/$DAEMON" -- \
--pid-file="$PIDFILE"
# shellcheck disable=SC2181
[ $? = 0 ] && echo "OK" || echo "FAIL"
;;
stop)
printf "Stopping dnsmasq: "
start-stop-daemon -K -q -p "$PIDFILE" -x "/usr/sbin/$DAEMON"
# shellcheck disable=SC2181
[ $? = 0 ] && echo "OK" || echo "FAIL"
# wait for dnsmasq process to be gone
while true; do
pid="$( cat "${PIDFILE}" 2>/dev/null || true )"
{ [ -n "${pid}" ] && [ -d "/proc/${pid}" ]; } || break
sleep 0.1
done
rm -f "$PIDFILE"
;;
restart|reload)
$0 stop
+1 -1
View File
@@ -1,3 +1,3 @@
# Locally calculated
sha256 96ed5d7c33a12f505d13fa03fa48f94cb41cf871178df0df84aa0b76839ad321 docker-cli-26.0.0.tar.gz
sha256 b047e180c94452b4375f7e43997286e5a5712e66b1280574974b2e117b4e43bd docker-cli-26.0.2.tar.gz
sha256 2d81ea060825006fc8f3fe28aa5dc0ffeb80faf325b612c955229157b8c10dc0 LICENSE
+1 -1
View File
@@ -4,7 +4,7 @@
#
################################################################################
DOCKER_CLI_VERSION = 26.0.0
DOCKER_CLI_VERSION = 26.0.2
DOCKER_CLI_SITE = $(call github,docker,cli,v$(DOCKER_CLI_VERSION))
DOCKER_CLI_LICENSE = Apache-2.0
+1 -1
View File
@@ -1,3 +1,3 @@
# Locally computed
sha256 931bfcc34eb43106be07787372bb853d4cd82830a5785f3049c5192ab0e4ac35 docker-compose-2.24.7.tar.gz
sha256 105328838a48dad4a305903c5ae98b928e8a4ea3546e1711690e9eef7e0232be docker-compose-2.26.1.tar.gz
sha256 58d1e17ffe5109a7ae296caafcadfdbe6a7d176f0bc4ab01e12a689b0499d8bd LICENSE
+1 -1
View File
@@ -4,7 +4,7 @@
#
################################################################################
DOCKER_COMPOSE_VERSION = 2.24.7
DOCKER_COMPOSE_VERSION = 2.26.1
DOCKER_COMPOSE_SITE = $(call github,docker,compose,v$(DOCKER_COMPOSE_VERSION))
DOCKER_COMPOSE_LICENSE = Apache-2.0
DOCKER_COMPOSE_LICENSE_FILES = LICENSE
+1 -1
View File
@@ -1,3 +1,3 @@
# Locally calculated
sha256 fae1aabb63ed5cf6d302a5f4266ed092716b1cea9a974a9d61154ef31b03c302 docker-engine-26.0.0.tar.gz
sha256 f1cf6a2e69607daa0e2ae9b5be752dc269ab30dee16f5f2180f7ff7f29270606 docker-engine-26.0.2.tar.gz
sha256 7c87873291f289713ac5df48b1f2010eb6963752bbd6b530416ab99fc37914a8 LICENSE
+1 -1
View File
@@ -4,7 +4,7 @@
#
################################################################################
DOCKER_ENGINE_VERSION = 26.0.0
DOCKER_ENGINE_VERSION = 26.0.2
DOCKER_ENGINE_SITE = $(call github,moby,moby,v$(DOCKER_ENGINE_VERSION))
DOCKER_ENGINE_LICENSE = Apache-2.0
-1
View File
@@ -7,7 +7,6 @@
DOOM_WAD_VERSION = 1.9
DOOM_WAD_SOURCE = doom$(subst .,,$(DOOM_WAD_VERSION))s.zip
# Official server currently unavailable
# DOOM_WAD_SITE = ftp://ftp.idsoftware.com/idstuff/doom
DOOM_WAD_SITE = http://www.jbserver.com/downloads/games/doom/misc/shareware
define DOOM_WAD_EXTRACT_CMDS
+1 -1
View File
@@ -32,7 +32,7 @@ config BR2_PACKAGE_DOVECOT_SQLITE
help
Enable SQLite support.
source package/dovecot-pigeonhole/Config.in
source "package/dovecot-pigeonhole/Config.in"
endif # BR2_PACKAGE_DOVECOT
+1
View File
@@ -20,6 +20,7 @@ define DUMA_BUILD_CMDS
$(TARGET_MAKE_ENV) $(MAKE1) $(TARGET_CONFIGURE_OPTS) \
OS=linux \
DUMA_OPTIONS="$(DUMA_OPTIONS)" \
HOST_CFLAGS="$(HOST_CFLAGS)" \
CPPFLAGS="$(TARGET_CXXFLAGS) -std=c++11" -C $(@D)
endef
+1 -1
View File
@@ -1,4 +1,4 @@
# ftp://ftp.netfilter.org/pub/ebtables/ebtables-2.0.11.tar.gz.sha256sum
# https://netfilter.org/pub/ebtables/ebtables-2.0.11.tar.gz.sha256sum
sha256 b71f654784a726329f88b412ef7b96b4e5d786ed2bd28193ed7b4c0d677dfd2a ebtables-2.0.11.tar.gz
# Locally computed
sha256 ebdb8ae564c952792017ec680e2edd30443642216eb9f8a3d8fa166c0cb628c1 COPYING
+1 -1
View File
@@ -5,7 +5,7 @@
################################################################################
EBTABLES_VERSION = 2.0.11
EBTABLES_SITE = http://ftp.netfilter.org/pub/ebtables
EBTABLES_SITE = https://netfilter.org/pub/ebtables
EBTABLES_LICENSE = GPL-2.0+
EBTABLES_LICENSE_FILES = COPYING
EBTABLES_CPE_ID_VENDOR = netfilter
@@ -0,0 +1,34 @@
From eead8d5e9f3911243182311f16178c25c6ea03c4 Mon Sep 17 00:00:00 2001
From: Waldemar Brodkorb <wbx@openadk.org>
Date: Sat, 23 Mar 2024 07:23:45 +0100
Subject: [PATCH] fix alignment for new-style ctors when using riscv64
Recently uClibc-ng enabled UCLIBC_CTOR_DTOR for riscv64, so
that f.e. C++ applications are running fine. As a side effect
this breaks noMMU support. The problem is the alignment for
the ctors in elf2flt. This patch fixes it.
Tested with Qemu for ARM, M68k and Xtensa with no regressions.
Signed-off-by: Waldemar Brodkorb <wbx@openadk.org>
Upstream: https://github.com/uclinux-dev/elf2flt/commit/eead8d5e9f3911243182311f16178c25c6ea03c4
---
elf2flt.ld.in | 2 +-
1 file changed, 1 insertion(+), 1 deletion(-)
diff --git a/elf2flt.ld.in b/elf2flt.ld.in
index a99c69e..230c382 100644
--- a/elf2flt.ld.in
+++ b/elf2flt.ld.in
@@ -139,7 +139,7 @@ R_RODAT: *(.gnu.linkonce.r*)
@SYMBOL_PREFIX@_ssro_size = @SYMBOL_PREFIX@_essro - @SYMBOL_PREFIX@_ssro;
PROVIDE(@SYMBOL_PREFIX@_SDA2_BASE_ = @SYMBOL_PREFIX@_ssro + (@SYMBOL_PREFIX@_ssro_size / 2));
- . = ALIGN(4) ;
+ . = ALIGN(8) ;
TOR: @SYMBOL_PREFIX@__CTOR_LIST__ = .;
TOR: LONG((@SYMBOL_PREFIX@__CTOR_END__ - @SYMBOL_PREFIX@__CTOR_LIST__) / 4 - 2)
SINGLE_LINK: /* gcc uses crtbegin.o to find the start of
--
2.30.2
+1
View File
@@ -27,6 +27,7 @@ HOST_ELFUTILS_CONF_OPTS = \
--with-bzlib \
--with-lzma \
--without-zstd \
--disable-demangler \
--disable-progs
ELFUTILS_LDFLAGS = $(TARGET_LDFLAGS) \
+1
View File
@@ -9,6 +9,7 @@ EVEMU_SITE = http://www.freedesktop.org/software/evemu
EVEMU_SOURCE = evemu-$(EVEMU_VERSION).tar.xz
EVEMU_LICENSE = LGPL-3.0 (library), GPL-3.0 (tools)
EVEMU_LICENSE_FILES = COPYING
EVEMU_INSTALL_STAGING = YES
# asciidoc used to generate manpages, which we don't need, and if it's
# present on the build host, it ends getting called with our host-python
+1 -1
View File
@@ -1,5 +1,5 @@
# Locally calculated after verifying signature
# ftp://ftp.astron.com/pub/file/file-5.45.tar.gz.asc
# https://astron.com/pub/file/file-5.45.tar.gz.asc
# using key BE04995BA8F90ED0C0C176C471112AB16CB33B3A
sha256 fc97f51029bb0e2c9f4e3bffefdaf678f0e039ee872b9de5c002a6d09c784d82 file-5.45.tar.gz
sha256 0bfa856a9930bddadbef95d1be1cf4e163c0be618e76ea3275caaf255283e274 COPYING
+1 -1
View File
@@ -5,7 +5,7 @@
################################################################################
FILE_VERSION = 5.45
FILE_SITE = ftp://ftp.astron.com/pub/file
FILE_SITE = https://astron.com/pub/file
FILE_LICENSE = BSD-2-Clause, BSD-4-Clause (one file), BSD-3-Clause (one file)
FILE_LICENSE_FILES = COPYING src/mygetopt.h src/vasprintf.c
FILE_CPE_ID_VALID = YES
+1 -1
View File
@@ -1,3 +1,3 @@
# Locally computed
sha256 1529ef5bc3b9ef3adc2a7964505912f7305103e269e50cc0316f500b22053ac9 fluidsynth-2.3.4.tar.gz
sha256 f89e8e983ecfb4a5b4f5d8c2b9157ed18d15ed2e36246fa782f18abaea550e0d fluidsynth-2.3.5.tar.gz
sha256 9b872a8a070b8ad329c4bd380fb1bf0000f564c75023ec8e1e6803f15364b9e9 LICENSE
+1 -1
View File
@@ -4,7 +4,7 @@
#
################################################################################
FLUIDSYNTH_VERSION = 2.3.4
FLUIDSYNTH_VERSION = 2.3.5
FLUIDSYNTH_SITE = $(call github,FluidSynth,fluidsynth,v$(FLUIDSYNTH_VERSION))
FLUIDSYNTH_LICENSE = LGPL-2.1+
FLUIDSYNTH_LICENSE_FILES = LICENSE
@@ -5,7 +5,7 @@
################################################################################
FREERADIUS_CLIENT_VERSION = 1.1.7
FREERADIUS_CLIENT_SITE = ftp://ftp.freeradius.org/pub/freeradius
FREERADIUS_CLIENT_SITE = https://freeradius.org/ftp/pub/freeradius
FREERADIUS_CLIENT_LICENSE = BSD-2-Clause
FREERADIUS_CLIENT_LICENSE_FILES = COPYRIGHT
FREERADIUS_CLIENT_INSTALL_STAGING = YES
@@ -1,4 +1,4 @@
# Locally computed, after checking
# ftp://ftp.freeradius.org/pub/freeradius/freeradius-server-3.2.3.tar.bz2.sig
# https://freeradius.org/ftp/pub/freeradius/freeradius-server-3.2.3.tar.bz2.sig
sha256 4a16aeffbfa1424e1f317fdf71d17e5523a4fd9564d87c747a60595ef93c5d1f freeradius-server-3.2.3.tar.bz2
sha256 0a0e46014fc2efd5144a30359c0e6e1ea9fa3dd407d3318204150efd7b4caf6a COPYRIGHT
@@ -7,7 +7,7 @@
FREERADIUS_SERVER_VERSION = 3.2.3
FREERADIUS_SERVER_SOURCE = \
freeradius-server-$(FREERADIUS_SERVER_VERSION).tar.bz2
FREERADIUS_SERVER_SITE = ftp://ftp.freeradius.org/pub/freeradius
FREERADIUS_SERVER_SITE = https://freeradius.org/ftp/pub/freeradius
FREERADIUS_SERVER_LICENSE = GPL-2.0
FREERADIUS_SERVER_LICENSE_FILES = COPYRIGHT
FREERADIUS_SERVER_CPE_ID_VENDOR = freeradius
+2 -2
View File
@@ -1,5 +1,5 @@
# From https://pub.freerdp.com/releases/freerdp-2.11.5.tar.gz.sha256
sha256 70785ad9934d75aed1734f8918a05aff95788e58e53081e84651106b24303dc2 freerdp-2.11.5.tar.gz
# From https://pub.freerdp.com/releases/freerdp-2.11.6.tar.gz.sha256
sha256 ad5a0c7761b18af914041ed50902d6c9fd553e65eeba8a1bea41c4149980b84c freerdp-2.11.6.tar.gz
# Locally calculated
sha256 cfc7749b96f63bd31c3c42b5c471bf756814053e847c10f3eb003417bc523d30 LICENSE
+1 -1
View File
@@ -4,7 +4,7 @@
#
################################################################################
FREERDP_VERSION = 2.11.5
FREERDP_VERSION = 2.11.6
FREERDP_SITE = https://pub.freerdp.com/releases
FREERDP_DEPENDENCIES = libglib2 openssl zlib
FREERDP_LICENSE = Apache-2.0
+1 -1
View File
@@ -6,7 +6,7 @@
FWTS_VERSION = 23.07.00
FWTS_SOURCE = fwts-V$(FWTS_VERSION).tar.gz
FWTS_SITE = http://fwts.ubuntu.com/release
FWTS_SITE = https://fwts.ubuntu.com/release
FWTS_STRIP_COMPONENTS = 0
FWTS_LICENSE = GPL-2.0, LGPL-2.1, Custom
FWTS_LICENSE_FILES = debian/copyright
-1
View File
@@ -1 +0,0 @@
../gcc/13.2.0/
+1
View File
@@ -0,0 +1 @@
../gcc/13.3.0/
+3 -1
View File
@@ -4,13 +4,15 @@
#
################################################################################
HOST_GCC_BARE_METAL_VERSION = 13.2.0
HOST_GCC_BARE_METAL_VERSION = 13.3.0
HOST_GCC_BARE_METAL_SITE = \
https://ftp.gnu.org/gnu/gcc/gcc-$(HOST_GCC_BARE_METAL_VERSION)
HOST_GCC_BARE_METAL_SOURCE = gcc-$(HOST_GCC_BARE_METAL_VERSION).tar.xz
HOST_GCC_BARE_METAL_LICENSE = GPL-2.0, GPL-3.0, LGPL-2.1, LGPL-3.0
HOST_GCC_BARE_METAL_LICENSE_FILES = COPYING COPYING3 COPYING.LIB COPYING3.LIB
HOST_GCC_BARE_METAL_CPE_ID_VENDOR = gnu
HOST_GCC_BARE_METAL_CPE_ID_PRODUCT = gcc
HOST_GCC_BARE_METAL_DEPENDENCIES = \
host-binutils-bare-metal \
@@ -0,0 +1,37 @@
From d1fc3505cc09d0ee02abbb732eafc91967c3ac07 Mon Sep 17 00:00:00 2001
From: Iain Sandoe <iain@sandoe.co.uk>
Date: Mon, 23 Aug 2021 17:34:43 +0100
Subject: [PATCH] libiberty, Darwin: Fix a build warning.
r12-3005-g220c410162ebece4f missed a cast for the set_32 call.
Fixed thus.
Signed-off-by: Iain Sandoe <iain@sandoe.co.uk>
libiberty/ChangeLog:
* simple-object-mach-o.c (simple_object_mach_o_write_segment):
Cast the first argument to set_32 as needed.
Upstream: https://gcc.gnu.org/git/?p=gcc.git;a=commit;h=38757aa88735ab2e511bc428e2407a5a5e9fa0be
Signed-off-by: Brandon Maier <brandon.maier@collins.com>
---
libiberty/simple-object-mach-o.c | 2 +-
1 file changed, 1 insertion(+), 1 deletion(-)
diff --git a/libiberty/simple-object-mach-o.c b/libiberty/simple-object-mach-o.c
index 72b69d19c21..a8869e7c639 100644
--- a/libiberty/simple-object-mach-o.c
+++ b/libiberty/simple-object-mach-o.c
@@ -1228,7 +1228,7 @@ simple_object_mach_o_write_segment (simple_object_write *sobj, int descriptor,
/* Swap the indices, if required. */
for (i = 0; i < (nsects_in * 4); ++i)
- set_32 (&index[i], index[i]);
+ set_32 ((unsigned char *) &index[i], index[i]);
sechdr_offset += sechdrsize;
--
2.45.0
+1 -1
View File
@@ -78,7 +78,7 @@ config BR2_GCC_VERSION
default "8.4.0" if BR2_GCC_VERSION_POWERPC_SPE
default "11.4.0" if BR2_GCC_VERSION_11_X
default "12.3.0" if BR2_GCC_VERSION_12_X
default "13.2.0" if BR2_GCC_VERSION_13_X
default "13.3.0" if BR2_GCC_VERSION_13_X
default "arc-2023.09-release" if BR2_GCC_VERSION_ARC
config BR2_EXTRA_GCC_CONFIG_OPTIONS
+2 -2
View File
@@ -6,8 +6,8 @@ sha512 440c08ca746da450d9a1b35e8fd2305cb27e7e6987cd9d0f7d375f3b1fc9e4b0bd7acb3c
sha512 a5018bf1f1fa25ddf33f46e720675d261987763db48e7a5fdf4c26d3150a8abcb82fdc413402df1c32f2e6b057d9bae6bdfa026defc4030e10144a8532e60f14 gcc-11.4.0.tar.xz
# From https://gcc.gnu.org/pub/gcc/releases/gcc-12.3.0/sha512.sum
sha512 8fb799dfa2e5de5284edf8f821e3d40c2781e4c570f5adfdb1ca0671fcae3fb7f794ea783e80f01ec7bfbf912ca508e478bd749b2755c2c14e4055648146c204 gcc-12.3.0.tar.xz
# From https://gcc.gnu.org/pub/gcc/releases/gcc-13.2.0/sha512.sum
sha512 d99e4826a70db04504467e349e9fbaedaa5870766cda7c5cab50cdebedc4be755ebca5b789e1232a34a20be1a0b60097de9280efe47bdb71c73251e30b0862a2 gcc-13.2.0.tar.xz
# From https://gcc.gnu.org/pub/gcc/releases/gcc-13.3.0/sha512.sum
sha512 ed5f2f4c6ed2c796fcf2c93707159e9dbd3ddb1ba063d549804dd68cdabbb6d550985ae1c8465ae9a336cfe29274a6eb0f42e21924360574ebd8e5d5c7c9a801 gcc-13.3.0.tar.xz
# Locally calculated (fetched from Github)
sha512 4dca20f517a42bb027fec605965b09fb917a535eebf3fe3e811d93476b02b1962df5ad4665f117bd44c2ec8e8015d51a44c00591761fe5f259c201ac5c7d920f gcc-arc-2023.09-release.tar.gz
+3 -3
View File
@@ -6,7 +6,7 @@ config BR2_PACKAGE_GDAL
depends on !BR2_STATIC_LIBS
depends on BR2_TOOLCHAIN_GCC_AT_LEAST_4_7 # C++11, proj
depends on !BR2_TOOLCHAIN_HAS_BINUTILS_BUG_27597
depends on BR2_TOOLCHAIN_HAS_THREADS # proj
depends on BR2_TOOLCHAIN_HAS_THREADS_NPTL # proj
depends on BR2_USE_WCHAR # proj
select BR2_PACKAGE_GIFLIB
select BR2_PACKAGE_JPEG
@@ -26,9 +26,9 @@ config BR2_PACKAGE_GDAL
https://gdal.org/
comment "gdal needs a toolchain w/ C++, dynamic library, gcc >= 4.7, not binutils bug 27597, threads, wchar"
comment "gdal needs a toolchain w/ C++, dynamic library, gcc >= 4.7, not binutils bug 27597, NPTL, wchar"
depends on BR2_TOOLCHAIN_HAS_SYNC_4
depends on !BR2_INSTALL_LIBSTDCPP || BR2_STATIC_LIBS || \
!BR2_TOOLCHAIN_GCC_AT_LEAST_4_7 || \
BR2_TOOLCHAIN_HAS_BINUTILS_BUG_27597 || \
!BR2_TOOLCHAIN_HAS_THREADS || !BR2_USE_WCHAR
!BR2_TOOLCHAIN_HAS_THREADS_NPTL || !BR2_USE_WCHAR
+1 -1
View File
@@ -1,5 +1,5 @@
# From: https://www.kernel.org/pub/software/scm/git/sha256sums.asc
sha256 5446603e73d911781d259e565750dcd277a42836c8e392cac91cf137aa9b76ec git-2.43.0.tar.xz
sha256 8b7cc3db84c5c6a2eeb39c63686ff5cde26278e32bb0d2226a8b424488420b98 git-2.43.5.tar.xz
# Locally calculated
sha256 5b2198d1645f767585e8a88ac0499b04472164c0d2da22e75ecf97ef443ab32e COPYING
sha256 1922f45d2c49e390032c9c0ba6d7cac904087f7cec51af30c2b2ad022ce0e76a LGPL-2.1
+1 -1
View File
@@ -4,7 +4,7 @@
#
################################################################################
GIT_VERSION = 2.43.0
GIT_VERSION = 2.43.5
GIT_SOURCE = git-$(GIT_VERSION).tar.xz
GIT_SITE = $(BR2_KERNEL_MIRROR)/software/scm/git
GIT_LICENSE = GPL-2.0, LGPL-2.1+
+1
View File
@@ -1,5 +1,6 @@
config BR2_PACKAGE_GNUPLOT
bool "gnuplot"
select BR2_PACKAGE_READLINE if !BR2_PACKAGE_LIBEDIT
help
A portable command-line driven graphing utility.
+3 -2
View File
@@ -41,8 +41,9 @@ endif
ifeq ($(BR2_PACKAGE_READLINE),y)
GNUPLOT_CONF_OPTS += --with-readline=gnu
GNUPLOT_DEPENDENCIES += readline
else
GNUPLOT_CONF_OPTS += --without-readline
else ifeq ($(BR2_PACKAGE_LIBEDIT),y)
GNUPLOT_CONF_OPTS += --with-readline=bsd
GNUPLOT_DEPENDENCIES += libedit
endif
# Remove Javascript scripts, lua scripts, PostScript files
+1 -1
View File
@@ -1,3 +1,3 @@
# From https://go.dev/dl
sha256 58f0c5ced45a0012bce2ff7a9df03e128abcc8818ebabe5027bb92bafe20e421 go1.21.9.src.tar.gz
sha256 42aee9bf2b6956c75a7ad6aa3f0a51b5821ffeac57f5a2e733a2d6eae1e6d9d2 go1.21.11.src.tar.gz
sha256 2d36597f7117c38b006835ae7f537487207d8ec407aa9d9980794b2030cbc067 LICENSE
+1 -1
View File
@@ -4,7 +4,7 @@
#
################################################################################
GO_VERSION = 1.21.9
GO_VERSION = 1.21.11
GO_SITE = https://storage.googleapis.com/golang
GO_SOURCE = go$(GO_VERSION).src.tar.gz
+4 -2
View File
@@ -23,8 +23,10 @@ GR_OSMOSDR_CONF_OPTS = \
GR_OSMOSDR_INSTALL_STAGING = YES
ifeq ($(BR2_PACKAGE_GNURADIO_PYTHON),y)
GR_OSMOSDR_CONF_OPTS += -DENABLE_PYTHON=ON
GR_OSMOSDR_DEPENDENCIES += python3
GR_OSMOSDR_CONF_OPTS += \
-DENABLE_PYTHON=ON \
-DPYTHON_INCLUDE_DIRS=$(STAGING_DIR)/usr/include/python$(PYTHON3_VERSION_MAJOR)
GR_OSMOSDR_DEPENDENCIES += python3 host-python-six
else
GR_OSMOSDR_CONF_OPTS += -DENABLE_PYTHON=OFF
endif
@@ -746,11 +746,12 @@ config BR2_PACKAGE_GST1_PLUGINS_BAD_ZXING
depends on !BR2_STATIC_LIBS # zxing-cpp
depends on BR2_USE_WCHAR # zxing-cpp
depends on BR2_INSTALL_LIBSTDCPP # zxing-cpp
depends on BR2_TOOLCHAIN_HAS_THREADS # zxing-cpp
select BR2_PACKAGE_ZXING_CPP
comment "zxing plugin needs a toolchain w/ C++, wchar, dynamic library"
comment "zxing plugin needs a toolchain w/ C++, wchar, dynamic library, threads"
depends on BR2_STATIC_LIBS || !BR2_USE_WCHAR || \
!BR2_INSTALL_LIBSTDCPP
!BR2_INSTALL_LIBSTDCPP || !BR2_TOOLCHAIN_HAS_THREADS
endif
@@ -293,6 +293,8 @@ config BR2_PACKAGE_GST1_PLUGINS_GOOD_PLUGIN_QMLGL
select BR2_PACKAGE_QT5BASE_WIDGETS
select BR2_PACKAGE_QT5DECLARATIVE
select BR2_PACKAGE_QT5DECLARATIVE_QUICK
select BR2_PACKAGE_QT5TOOLS
select BR2_PACKAGE_QT5TOOLS_LINGUIST_TOOLS
select BR2_PACKAGE_QT5X11EXTRAS if BR2_PACKAGE_QT5BASE_XCB
help
QT5 plugin which includes elements qmlglsrc and qmlglsink
@@ -357,7 +357,7 @@ endif
ifeq ($(BR2_PACKAGE_GST1_PLUGINS_GOOD_PLUGIN_QMLGL),y)
GST1_PLUGINS_GOOD_CONF_OPTS += -Dqt5=enabled
GST1_PLUGINS_GOOD_DEPENDENCIES += qt5declarative
GST1_PLUGINS_GOOD_DEPENDENCIES += qt5declarative qt5tools
ifeq ($(BR2_PACKAGE_QT5BASE_XCB),y)
GST1_PLUGINS_GOOD_DEPENDENCIES += qt5x11extras
endif
+1 -1
View File
@@ -15,7 +15,7 @@ config BR2_PACKAGE_HIDAPI
http://github.com/libusb/hidapi/
comment "hidapi needs udev /dev management and a toolchain w/ NPTL, threads, gcc >= 4.9"
comment "hidapi needs udev /dev management and a toolchain w/ NPTL, gcc >= 4.9"
depends on !BR2_TOOLCHAIN_HAS_THREADS_NPTL || \
!BR2_PACKAGE_HAS_UDEV || \
!BR2_TOOLCHAIN_GCC_AT_LEAST_4_9
+2 -2
View File
@@ -1,3 +1,3 @@
# Locally computed
sha256 09402e5f17c6575ef9f010bb2e21ae1710f1f3426f115ad4317ee9129c32608e imagemagick-7.1.1-21.tar.gz
sha256 8cceeb67d4e783cb63075c7311fdb990fa0369ee80fbd0f481064cd02386ca2d LICENSE
sha256 c82210ea3fdbd044b656ba3d5b42df1da9a18e78fc0e500169bad70d3b0d9ba3 imagemagick-7.1.1-31.tar.gz
sha256 a556c5292c87c9a6ac795c80669b0c3660f9f729de8c476bf2b10f83ab1b34ec LICENSE
+1 -1
View File
@@ -4,7 +4,7 @@
#
################################################################################
IMAGEMAGICK_VERSION = 7.1.1-21
IMAGEMAGICK_VERSION = 7.1.1-31
IMAGEMAGICK_SITE = $(call github,ImageMagick,ImageMagick,$(IMAGEMAGICK_VERSION))
IMAGEMAGICK_LICENSE = Apache-2.0
IMAGEMAGICK_LICENSE_FILES = LICENSE
+1 -1
View File
@@ -1,3 +1,3 @@
# Locally computed
sha256 381f7ad104e3d0d8dd6c3ec0c8304e410a479c439e72db35c83fb7e2b0ec556f intel-gmmlib-22.3.18.tar.gz
sha256 ea9c418b0fd84a982850f230cb2d783dfe2e1f9923065f54b2fcaad1e9b33417 intel-gmmlib-22.3.19.tar.gz
sha256 8b7446825df3f8b0268307e272aa6aaaf78351c83161d860d02c913c22666c48 LICENSE.md

Some files were not shown because too many files have changed in this diff Show More