This reverts commit 3daacade13.
The libdrm tests also include the useful command line utilities such as
modetest and modeprint, so leave them enabled.
Signed-off-by: Peter Korsgaard <peter@korsgaard.com>
Commit 24e996d14d (package/xvisor: fix build without python interpreter)
added a dependency on host-python3 for the d2c.py script, but this script
does not use any non-standard python modules so we can instead use
BR2_PYTHON3_HOST_DEPENDENCY to only build host-python3 if the build host
does not have python3.
Signed-off-by: Peter Korsgaard <peter@korsgaard.com>
(cherry picked from commit 7f08dc612c)
Signed-off-by: Peter Korsgaard <peter@korsgaard.com>
Set default editor to /bin/vi to fix the following build failure when no
editor is found on host:
configure:40833: checking for vim
configure:40862: result: no
configure:40833: checking for vi
configure:40862: result: no
configure:40833: checking for emacs
configure:40862: result: no
configure:40833: checking for nano
configure:40862: result: no
configure:40833: checking for pico
configure:40862: result: no
configure:40833: checking for edit
configure:40862: result: no
configure:40874: error:
Failed to find a text file editor. CVS cannot be compiled
without a default log message editor. Searched for
`vim vi emacs nano pico edit'. Try `configure --with-editor'.
While at it, drop CVS_CONFIGURE_ARGS variable for simplicity
Fixes:
- http://autobuild.buildroot.org/results/5b8a747698bc2e64eb1f001e87577e86e4cb8d14
Signed-off-by: Fabrice Fontaine <fontaine.fabrice@gmail.com>
Signed-off-by: Arnout Vandecappelle <arnout@mind.be>
(cherry picked from commit 1455d5241b)
Signed-off-by: Peter Korsgaard <peter@korsgaard.com>
Fix the following build failure raised since bump of libressl to version
3.5.2 in commit 8b216927db:
red-stream.cpp: In function 'RedStreamSslStatus red_stream_ssl_accept(RedStream*)':
red-stream.cpp:526:22: error: invalid use of incomplete type 'SSL' {aka 'struct ssl_st'}
526 | stream->priv->ssl->s3->flags |= SSL3_FLAGS_NO_RENEGOTIATE_CIPHERS;
| ^~
In file included from /home/buildroot/autobuild/instance-1/output-1/host/i686-buildroot-linux-gnu/sysroot/usr/include/openssl/err.h:120,
from red-stream.cpp:33:
/home/buildroot/autobuild/instance-1/output-1/host/i686-buildroot-linux-gnu/sysroot/usr/include/openssl/ossl_typ.h:173:16: note: forward declaration of 'SSL' {aka 'struct ssl_st'}
173 | typedef struct ssl_st SSL;
| ^~~~~~
Fixes:
- http://autobuild.buildroot.org/results/273eadf9e49af55e0932a8293ca65762fb43114f
- http://autobuild.buildroot.org/results/97601f321efc532de0c2ea6aa618ce11fad9e851
Signed-off-by: Fabrice Fontaine <fontaine.fabrice@gmail.com>
Signed-off-by: Peter Korsgaard <peter@korsgaard.com>
(cherry picked from commit 4e5ea31630)
Signed-off-by: Peter Korsgaard <peter@korsgaard.com>
bump to latest version because previous version did not work with python 3.11
Signed-off-by: Jeremy J. Peper <jeremy@jeremypeper.com>
Signed-off-by: Arnout Vandecappelle <arnout@mind.be>
(cherry picked from commit 8a69af5fa4)
Signed-off-by: Peter Korsgaard <peter@korsgaard.com>
bump to latest version because previous version did not work with python 3.11
Signed-off-by: Jeremy J. Peper <jeremy@jeremypeper.com>
Signed-off-by: Arnout Vandecappelle <arnout@mind.be>
(cherry picked from commit 0c27711002)
Signed-off-by: Peter Korsgaard <peter@korsgaard.com>
bump to latest version because previous version did not work with python 3.11
corrected version mismatch with my first submission
Signed-off-by: Jeremy J. Peper <jeremy@jeremypeper.com>
Signed-off-by: Arnout Vandecappelle <arnout@mind.be>
(cherry picked from commit 242781bb61)
Signed-off-by: Peter Korsgaard <peter@korsgaard.com>
Without python-gobject, we get the following runtime error:
ModuleNotFoundError: No module named 'gi'
Add python-gobject and propagate its dependencies.
While we're at it, split the DEPENDENCIES over several line and sort
them alphabetically.
Signed-off-by: Jeremy J. Peper <jeremy@jeremypeper.com>
Reviewed-by: Adam Duskett <adam.duskett@amarulasolutions.com>
[Arnout: reorder everything alphabeticall, split DEPENDENCIES over
several lines.]
Signed-off-by: Arnout Vandecappelle <arnout@mind.be>
(cherry picked from commit 945b9f8d8e)
Signed-off-by: Peter Korsgaard <peter@korsgaard.com>
* Remove patch applied upstream.
* Upstream fixed building inside the source tree, but still does not
recommend it, so keep LIBGIT2_SUPPORTS_IN_SOURCE_BUILD = NO
Signed-off-by: Nicolas Cavallari <nicolas.cavallari@green-communications.fr>
Signed-off-by: Yann E. MORIN <yann.morin.1998@free.fr>
(cherry picked from commit 4aef53575b)
Signed-off-by: Peter Korsgaard <peter@korsgaard.com>
* Fix the license because libgit2 has been using some android code
without attribution. This explains the change of the hash in the
license file, which now includes the text of the BSD-2-Clause
license.
* Building in-source is accidentely broken in this release and upstream
recommends a separate build directory anyway, so use a separate build
directory.
* Some win32-specific declarations use wchar_t, add an upstreamed patch
to avoid a dependency to wchar_t elsewhere.
Signed-off-by: Nicolas Cavallari <nicolas.cavallari@green-communications.fr>
Signed-off-by: Thomas Petazzoni <thomas.petazzoni@bootlin.com>
(cherry picked from commit f32176a767)
Signed-off-by: Peter Korsgaard <peter@korsgaard.com>
poco can't be built statically since commit
073a89196a. However, commit
add7c433d2 enabled static (and shared)
build with BR2_SHARED_STATIC_LIBS resulting in the following build
failure since at least version 1.11.1:
/home/buildroot/autobuild/instance-1/output-1/host/opt/ext-toolchain/bin/../lib/gcc/mips-buildroot-linux-gnu/11.2.0/../../../../mips-buildroot-linux-gnu/bin/ld: /home/buildroot/autobuild/instance-1/output-1/build/poco-1.11.1/lib/Linux/mips/libPocoXML.a(ParserEngine.o): in function `Poco::XML::ParserEngine::handleStartElement(void*, char const*, char const**)':
ParserEngine.cpp:(.text+0x2f8): undefined reference to `XML_GetSpecifiedAttributeCount'
Fixes: add7c433d2
- http://autobuild.buildroot.org/results/afc434a13d5e7a8affa4abb4058d7bebc81aca29
- http://autobuild.buildroot.org/results/860b70a8c9c4a6a53247ac4bdb4fd0851b28c61a
Signed-off-by: Fabrice Fontaine <fontaine.fabrice@gmail.com>
Signed-off-by: Peter Korsgaard <peter@korsgaard.com>
(cherry picked from commit fd484c1f57)
Signed-off-by: Peter Korsgaard <peter@korsgaard.com>
strace needs headers >= 5.0 and
https://github.com/torvalds/linux/commit/9966a05c7b80f075f2bc7e48dbb108d3f2927234
to avoid the following build failure on musl and aarch64 due to headers
conflict raised at least since bump to version 6.0 in commit
544806bfd8:
In file included from /home/autobuild/autobuild/instance-7/output-1/host/aarch64_be-buildroot-linux-musl/sysroot/usr/include/signal.h:48,
from strace.c:17:
/home/autobuild/autobuild/instance-7/output-1/host/aarch64_be-buildroot-linux-musl/sysroot/usr/include/bits/signal.h:18:16: error: redefinition of 'struct sigcontext'
18 | typedef struct sigcontext {
| ^~~~~~~~~~
In file included from /home/autobuild/autobuild/instance-7/output-1/host/aarch64_be-buildroot-linux-musl/sysroot/usr/include/asm/ptrace.h:26,
from /home/autobuild/autobuild/instance-7/output-1/host/aarch64_be-buildroot-linux-musl/sysroot/usr/include/linux/ptrace.h:107,
from ptrace.h:33,
from strace.c:16:
/home/autobuild/autobuild/instance-7/output-1/host/aarch64_be-buildroot-linux-musl/sysroot/usr/include/asm/sigcontext.h:28:8: note: originally defined here
28 | struct sigcontext {
| ^~~~~~~~~~
Fixes:
- http://autobuild.buildroot.org/results/74a480aa76970b36dcd890d9bd7a9df1d49e8e16
- http://autobuild.buildroot.org/results/79ee8ae5fb9712fd874b56e836eca1b997c50cd9
Signed-off-by: Fabrice Fontaine <fontaine.fabrice@gmail.com>
[Peter: fix architecture conditional]
Signed-off-by: Peter Korsgaard <peter@korsgaard.com>
(cherry picked from commit e2e8e655fe)
Signed-off-by: Peter Korsgaard <peter@korsgaard.com>
A vulnerability was found in obgm libcoap 4.3.4. It has been rated as
critical. Affected by this issue is the function get_split_entry of the
file src/coap_oscore.c of the component Configuration File Handler. The
manipulation leads to stack-based buffer overflow. The attack may be
launched remotely. The exploit has been disclosed to the public and may
be used. It is recommended to apply a patch to fix this issue.
VDB-252206 is the identifier assigned to this vulnerability.
Signed-off-by: Fabrice Fontaine <fontaine.fabrice@gmail.com>
Signed-off-by: Peter Korsgaard <peter@korsgaard.com>
(cherry picked from commit 9002b818be)
Signed-off-by: Peter Korsgaard <peter@korsgaard.com>
Fix CVE-2024-25062: An issue was discovered in libxml2 before 2.11.7 and
2.12.x before 2.12.5. When using the XML Reader interface with DTD
validation and XInclude expansion enabled, processing crafted XML
documents can lead to an xmlValidatePopElement use-after-free.
https://gitlab.gnome.org/GNOME/libxml2/-/blob/v2.11.7/NEWS
Signed-off-by: Peter Korsgaard <peter@korsgaard.com>
Commit 2c5a82a29c (package/openssh: select linux-pam if refpolicy
upstream is selected) did not account for the linux-pam dependencies
before selecting it, causing unmet dependencies warnings (unfortunately,
not errors), such as:
$ KCONFIG_SEED=0xCF227CF4 make randconfig
WARNING: unmet direct dependencies detected for BR2_PACKAGE_LINUX_PAM
Depends on [n]: BR2_ENABLE_LOCALE [=n] && BR2_USE_WCHAR [=n] && !BR2_STATIC_LIBS [=n] && BR2_USE_MMU [=y] && BR2_TOOLCHAIN_GCC_AT_LEAST_4_9 [=y]
Selected by [y]:
- BR2_PACKAGE_OPENSSH [=y] && BR2_USE_MMU [=y] && BR2_PACKAGE_REFPOLICY_UPSTREAM_VERSION [=y]
2c5a82a29c made the choice of having openssl bear the responsibility
to select linux-pam when the upstream refpolicy version was enabled.
Semantically however, the responsibility really lies within refpolicy
itself, since that's what imposes linux-pam to openssh.
Move the select to refpolicy and drop it from openssh. Then, ensure that
linux-pam is only selected when it is available.
That means that one may get an openssh that is not linked against
linux-pam, when the linux-pam dependencies are not met; refpolicy (by
way of libsepol) also has a more stringent requirement on gcc version
than linux-pam, so most probably the missing dependencies would be
locale, wchar, or a static build. We consider that situation to be a
corner case that we do not want to address.
In the future, we may have more similar situations, whereby refpolicy
would impose other packages be linked with otherwise optional
dependencies. If (when) that were (will be) the case, then the proposed
mechanism would quickly become ugly; we could then re-assess a nicer way
to do that. Until then, this is good ebough.
Signed-off-by: Yann E. MORIN <yann.morin.1998@free.fr>
Cc: Adam Duskett <adam.duskett@amarulasolutions.com>
Cc: Thomas Petazzoni <thomas.petazzoni@bootlin.com>
Cc: Fabrice Fontaine <fontaine.fabrice@gmail.com>
Signed-off-by: Peter Korsgaard <peter@korsgaard.com>
(cherry picked from commit c20b2ae4ec)
[Peter: drop gcc >= 4.9 dependency]
Signed-off-by: Peter Korsgaard <peter@korsgaard.com>
Currently, when the version string is "too long", it is arbitrarily
truncated.
This works well for commit hashes, because usually the truncation is
long enough to provide a short hash that is still unique in the
upstream VCS.
However, there are non-hash-like versions strings that get truncated
and wihch the discriminant part is toward the end.
Yet, adapting the version cell to the widest versions string (most
probably a git hash) is not very interesting; the table is already very
large.
Make the cell with the version string scrollable: we get to keep the
best of both worlds: a narrow version cell, and a full-length version
string that can be copy-pasted if needed.
Signed-off-by: Sen Hastings <sen@hastings.org>
[yann.morin.1998@free.fr: reword commit log]
Signed-off-by: Yann E. MORIN <yann.morin.1998@free.fr>
(cherry picked from commit 4533e42622)
Signed-off-by: Peter Korsgaard <peter@korsgaard.com>
Fixes the following security issues:
CVE-2023-32002: Policies can be bypassed via Module._load (High)
CVE-2023-32006: Policies can be bypassed by module.constructor.createRequire (Medium)
CVE-2023-32559: Policies can be bypassed via process.binding (Medium)
CVE-2023-30581: mainModule.__proto__ Bypass Experimental Policy Mechanism (High)
CVE-2023-30585: Privilege escalation via Malicious Registry Key manipulation during Node.js installer repair process (Medium)
CVE-2023-30588: Process interuption due to invalid Public Key information in x509 certificates (Medium)
CVE-2023-30589: HTTP Request Smuggling via Empty headers separated by CR (Medium)
CVE-2023-30590: DiffieHellman does not generate keys after setting a private key (Medium)
Signed-off-by: Peter Korsgaard <peter@korsgaard.com>
Commit b9e89b340e (sudo: bump version) introduced the explicit build
of mksigname and mksiglist as host tools, as they were required to run
on the build machine, to generate C code then used to build the target
program.
This is now failing to build since the bump to sudo 1.9.15p5 in commit
c87746afef (package/sudo: security bump to version 1.9.15p5)
(lines manually wrapped and slightly elided for ease of reviewing):
/usr/bin/cpp \
-I/home/ymorin/dev/buildroot/O/master/per-package/sudo/host/include \
-I../../include \
-I../.. \
./sys_signame.h \
| /usr/bin/sed -e '1,/^int sudo_end_of_headers;/d' -e '/^#/d' > mksigname.h
In file included from /usr/include/features.h:394,
from /usr/include/sys/types.h:25,
from ./sys_signame.h:4:
/usr/include/features-time64.h:26:5: error: #error "_TIME_BITS=64 is allowed only with _FILE_OFFSET_BITS=64"
26 | # error "_TIME_BITS=64 is allowed only with _FILE_OFFSET_BITS=64"
| ^~~~~
/usr/bin/gcc -I../../include -I../.. -I. -I. \
-D_PATH_SUDO_CONF=\"/etc/sudo.conf\"
-I/home/ymorin/dev/buildroot/O/master/per-package/sudo/host/include \
-DDEFAULT_TEXT_DOMAIN=\"sudo\" \
-O2 \
-I/home/ymorin/dev/buildroot/O/master/per-package/sudo/host/include \
./mksigname.c -o mksigname
In file included from /usr/include/features.h:394,
from /usr/include/bits/libc-header-start.h:33,
from /usr/include/stdlib.h:26,
from ./mksigname.c:27:
/usr/include/features-time64.h:26:5: error: #error "_TIME_BITS=64 is allowed only with _FILE_OFFSET_BITS=64"
26 | # error "_TIME_BITS=64 is allowed only with _FILE_OFFSET_BITS=64"
| ^~~~~
make[2]: *** [Makefile:263: mksigname] Error 1
The core of the issue has not been really identified, but it turns out
that neither mksiglist nor mksignames is used during the build. This has
been tested with a minimal sudo with no option, and with a sudo with all
options enabled (linux-pam, zlib, opensldap, and openssl), with the
three types of C libraries (glibc, musl, and uClibc-ng).
Digging in the sudo buildsystem did not reveal an obvious reason when
those would be needed either.
Drop the hook now it seems it is no longer used and is atually breaking
the build.
Fixes: http://autobuild.buildroot.org/results/72f/72ff18fb9b41394a29006f881ee1fbea67a66a09/
Note that there is a second issue in there: the call to the host cpp
fails, but since it is on the LHS of a pipe, the error is lost, as the
RHS of the pipe (the sed call) succeeds; a fix for that will be sent
in a separate patch.
Reported-by: Christian Stewart <christian@aperture.us>
Signed-off-by: Yann E. MORIN <yann.morin.1998@free.fr>
Cc: Peter Korsgaard <peter@korsgaard.com>
Reviewed-by: Christian Stewart <christian@aperture.us>
(cherry picked from commit 5aade5ced5)
Signed-off-by: Peter Korsgaard <peter@korsgaard.com>
Fixes the following security issues:
CVE-2023-40546 mok: fix LogError() invocation
CVE-2023-40547 - avoid incorrectly trusting HTTP headers
CVE-2023-40548 Fix integer overflow on SBAT section size on 32-bit system
CVE-2023-40549 Authenticode: verify that the signature header is in bounds.
CVE-2023-40550 pe: Fix an out-of-bound read in verify_buffer_sbat()
CVE-2023-40551: pe-relocate: Fix bounds check for MZ binaries
https://github.com/rhboot/shim/tree/15.8
Signed-off-by: Peter Korsgaard <peter@korsgaard.com>
Signed-off-by: Yann E. MORIN <yann.morin.1998@free.fr>
(cherry picked from commit f42004a046)
Signed-off-by: Peter Korsgaard <peter@korsgaard.com>
Fixes the following security issues:
https://wpewebkit.org/security/WSA-2024-0001.html
- CVE-2024-23222: Processing maliciously crafted web content may lead to
arbitrary code execution. Apple is aware of a report that this issue
may have been exploited. Description: A type confusion issue was
addressed with improved checks.
- CVE-2024-23206: A maliciously crafted webpage may be able to
fingerprint the user. Description: An access issue was addressed with
improved access restrictions.
- CVE-2024-23213: Processing web content may lead to arbitrary code
execution. Description: The issue was addressed with improved memory
handling.
Add an upstream post-2.42.5 patch to fix an issue with an invalid
backport causing a build issue.
Signed-off-by: Adrian Perez de Castro <aperez@igalia.com>
Signed-off-by: Yann E. MORIN <yann.morin.1998@free.fr>
(cherry picked from commit 5275e14125)
Signed-off-by: Peter Korsgaard <peter@korsgaard.com>
Move comment in Config.in to end of file so that
BR2_PACKAGE_GOOGLE_BREAKPAD_TOOLS is properly idented.
Signed-off-by: Nuno Gonçalves <nunog@fr24.com>
Signed-off-by: Yann E. MORIN <yann.morin.1998@free.fr>
(cherry picked from commit 2c6dc1fed3)
Signed-off-by: Peter Korsgaard <peter@korsgaard.com>
uClibc lacks process_vm_readv(), and sudo fails to build since commit
c87746afef (package/sudo: security bump to version 1.9.15p5), with
errors such as:
./exec_ptrace.c: In function ‘ptrace_write_vec’:
./exec_ptrace.c:895:9: error: ‘nwritten’ undeclared (first use in this function); did you mean ‘pwrite’?
895 | nwritten = ptrace_write_string(pid, strtab, vec[i]);
| ^~~~~~~~
| pwrite
Backport an upstream commit to fix the issue.
Signed-off-by: Yann E. MORIN <yann.morin.1998@free.fr>
(cherry picked from commit 0f0117ad94)
Signed-off-by: Peter Korsgaard <peter@korsgaard.com>
Fix the following openssl static build raised since commit
80fa5672da:
/home/buildroot/autobuild/instance-0/output-1/host/lib/gcc/aarch64_be-buildroot-linux-uclibc/12.3.0/../../../../aarch64_be-buildroot-linux-uclibc/bin/ld: /home/buildroot/autobuild/instance-0/output-1/host/aarch64_be-buildroot-linux-uclibc/sysroot/lib/../lib64/libcrypto.a(libcrypto-lib-c_zlib.o): in function `zlib_oneshot_expand_block':
c_zlib.c:(.text+0xaec): undefined reference to `uncompress'
Commit b9a062b354 can also be reverted as
pkg-config will also retrieve -latomic to avoid the following build
failure:
/home/autobuild/autobuild/instance-1/output-1/host/lib/gcc/sparc-buildroot-linux-uclibc/10.4.0/../../../../sparc-buildroot-linux-uclibc/bin/ld: /home/autobuild/autobuild/instance-1/output-1/host/sparc-buildroot-linux-uclibc/sysroot/usr/lib/libcrypto.a(threads_pthread.o): in function `CRYPTO_atomic_add':
threads_pthread.c:(.text+0x208): undefined reference to `__atomic_is_lock_free'
RSYNC_POST_CONFIGURE_HOOKS must be added to call reconfigure and avoid
the following build failure after autoreconf:
autoconf -o configure.sh
autoheader && touch config.h.in
configure.sh has CHANGED.
config.h.in is unchanged.
You may need to run:
make reconfigure
Fixes:
- http://autobuild.buildroot.org/results/6c1636f7556e7370a4c9f6d02c63cf3e20dc985c
- http://autobuild.buildroot.org/results/49abbaa1eab94b248bff434b40728065d687e278
Signed-off-by: Fabrice Fontaine <fontaine.fabrice@gmail.com>
Signed-off-by: Thomas Petazzoni <thomas.petazzoni@bootlin.com>
(cherry picked from commit e889a1c9e9)
Signed-off-by: Peter Korsgaard <peter@korsgaard.com>
Disable neon with soft float to fix the following build failure raised
at least since version 2.19.1:
In file included from build/include/botan/internal/simd_32.h:27,
from src/lib/block/aes/aes_vperm/aes_vperm.cpp:15:
/home/thomas/autobuild/instance-1/output-1/host/lib/gcc/arm-buildroot-linux-musleabi/10.4.0/include/arm_neon.h:31:2: error: #error "NEON intrinsics not available with the soft-float ABI. Please use -mfloat-abi=softfp or -mfloat-abi=hard"
31 | #error "NEON intrinsics not available with the soft-float ABI. Please use -mfloat-abi=softfp or -mfloat-abi=hard"
| ^~~~~
Fixes:
- http://autobuild.buildroot.org/results/6b311e97484db2b0f8adbda140320d696713b1e0
- http://autobuild.buildroot.org/results/c309940ea6db0845d8221fb51611d0254222c644
Signed-off-by: Fabrice Fontaine <fontaine.fabrice@gmail.com>
Signed-off-by: Thomas Petazzoni <thomas.petazzoni@bootlin.com>
(cherry picked from commit 48c5053576)
Signed-off-by: Peter Korsgaard <peter@korsgaard.com>
With recent asiidoc versions (at least 10.2.0 is known to report that),
rendering the manual yields a few warnings related to ordered lists:
asciidoc: WARNING: customize-quick-guide.adoc: line 13: list item index: expected 2 got 1
asciidoc: WARNING: customize-quick-guide.adoc: line 15: list item index: expected 3 got 1
[...]
asciidoc: WARNING: customize-quick-guide.adoc: line 65: list item index: expected 13 got 1
asciidoc: WARNING: customize-quick-guide.adoc: line 66: list item index: expected 14 got 1
asciidoc: WARNING: adding-packages-gettext.adoc: line 30: list item index: expected 2 got 1
asciidoc: WARNING: adding-packages-gettext.adoc: line 41: list item index: expected 3 got 1
The reason is that we use the same index to tell asciidoc to
automatically number items.
However, the official way to provide an automatic index is to write no
index:
https://docs.asciidoctor.org/asciidoc/latest/lists/ordered/
[...] since the numbering is obvious, the AsciiDoc processor will
insert the numbers for you if you omit them:
[...]
If you number the ordered list explicitly, you have to manually keep
the list numerals sequential. Otherwise, you will get a warning.
So, abide by the documentation, and drop the repeating indices to
ordered lists where we want automatic numbering.
Note that there is another ordered list, in adding-packages-directory.adoc,
but it does use explicit, sequential numbering. For consistency within
the whole document, we also convert it.
To avoid extra useless churn, the indentation of the items is not
changed to match the elided indices.
Signed-off-by: Yann E. MORIN <yann.morin.1998@free.fr>
Signed-off-by: Thomas Petazzoni <thomas.petazzoni@bootlin.com>
(cherry picked from commit 1c24d83cc8)
Signed-off-by: Peter Korsgaard <peter@korsgaard.com>
Fix the following static build failure with libpsl raised since bump to
version 8.6.0 in commit 5cee6b6be6:
configure:28830: /home/autobuild/autobuild/instance-6/output-1/host/bin/aarch64_be-buildroot-linux-musl-gcc -o conftest -D_LARGEFILE_SOURCE -D_LARGEFILE64_SOURCE -D_FILE_OFFSET_BITS=64 -O3 -g0 -static -Werror-implicit-function-declaration -Wno-system-headers -D_LARGEFILE_SOURCE -D_LARGEFILE64_SOURCE -D_FILE_OFFSET_BITS=64 -I/home/autobuild/autobuild/instance-6/output-1/host/aarch64_be-buildroot-linux-musl/sysroot/usr/include -static -L/home/autobuild/autobuild/instance-6/output-1/host/bin/../aarch64_be-buildroot-linux-musl/sysroot/usr/lib -L/home/autobuild/autobuild/instance-6/output-1/host/aarch64_be-buildroot-linux-musl/sysroot/usr/lib conftest.c -lpsl -lmbedtls -lmbedx509 -lmbedcrypto -lz -latomic >&5
/home/autobuild/autobuild/instance-6/output-1/host/lib/gcc/aarch64_be-buildroot-linux-musl/11.4.0/../../../../aarch64_be-buildroot-linux-musl/bin/ld: /home/autobuild/autobuild/instance-6/output-1/host/bin/../aarch64_be-buildroot-linux-musl/sysroot/usr/lib/libpsl.a(psl.c.o): in function `is_public_suffix':
psl.c:(.text+0x2a8): undefined reference to `idn2_lookup_u8'
[...]
checking for library containing psl_builtin... no
configure: error: libpsl was not found
Fixes: 5cee6b6be6
- http://autobuild.buildroot.org/results/1fb15e1a99472c403d0d3b1a688902f32e78d002
Signed-off-by: Fabrice Fontaine <fontaine.fabrice@gmail.com>
Signed-off-by: Peter Korsgaard <peter@korsgaard.com>
(cherry picked from commit bedcd1cd39)
Signed-off-by: Peter Korsgaard <peter@korsgaard.com>
phobosdpl is an old work email I don't really use anymore, so I'm
changing it to my personal email.
Signed-off-by: Sen Hastings <sen@phobosdpl.com>
Signed-off-by: Thomas Petazzoni <thomas.petazzoni@bootlin.com>
(cherry picked from commit 622fec1bb3)
Signed-off-by: Peter Korsgaard <peter@korsgaard.com>
- Fixed a regression in Django 4.2 that caused a crash of QuerySet.aggregate()
with aggregates referencing expressions containing subqueries (#34798).
- Restored, following a regression in Django 4.2, creating
varchar/text_pattern_ops indexes on CharField and TextField with
deterministic collations on PostgreSQL (#34932).
Tested on Fedora 39 with:
./support/testing/run-tests tests.package.test_python_django
Signed-off-by: Adam Duskett <adam.duskett@amarulasolutions.com>
Signed-off-by: Thomas Petazzoni <thomas.petazzoni@bootlin.com>
(cherry picked from commit be4347c088)
Signed-off-by: Peter Korsgaard <peter@korsgaard.com>
Fixes the following security issues:
https://webkitgtk.org/security/WSA-2024-0001.html
- CVE-2024-23222: Processing maliciously crafted web content may lead to
arbitrary code execution. Apple is aware of a report that this issue may
have been exploited. Description: A type confusion issue was addressed
with improved checks.
- CVE-2024-23206: A maliciously crafted webpage may be able to fingerprint
the user. Description: An access issue was addressed with improved access
restrictions.
- CVE-2024-23213: Processing web content may lead to arbitrary code execution.
Description: The issue was addressed with improved memory handling.
- CVE-2023-40414: Processing web content may lead to arbitrary code
execution. Description: A use-after-free issue was addressed with
improved memory management.
- CVE-2023-42833: Processing web content may lead to arbitrary code execution.
Description: A correctness issue was addressed with improved checks.
- CVE-2014-1745: Processing a file may lead to a denial-of-service or
potentially disclose memory contents. Description: The issue was
addressed with improved checks.
https://webkitgtk.org/security/WSA-2023-0012.html
- CVE-2023-42883: Processing a SVG image may lead to a denial-of-service.
Description: The issue was addressed with improved memory handling.
- CVE-2023-42890: Processing web content may lead to arbitrary code
execution. Description: The issue was addressed with improved memory
handling.
https://webkitgtk.org/security/WSA-2023-0011.html
- CVE-2023-42916: Processing web content may disclose sensitive information.
Apple is aware of a report that this issue may have been actively
exploited. Description: An out-of-bounds read was addressed with improved
input validation.
- CVE-2023-42917: Processing web content may lead to arbitrary code
execution. Apple is aware of a report that this issue may have been
actively exploited. Description: A memory corruption vulnerability was
addressed with improved locking.
Add an upstream post-2.42.5 patch to fix an issue with an invalid backport
causing a build issue.
Signed-off-by: Peter Korsgaard <peter@korsgaard.com>
Acked-by: Adrian Perez de Castro <aperez@igalia.com>
Signed-off-by: Peter Korsgaard <peter@korsgaard.com>
(cherry picked from commit de3684f57d)
Signed-off-by: Peter Korsgaard <peter@korsgaard.com>
Commit 1edb9d691d (package/v4l2loopback: add
V4L2LOOPBACK_CPE_ID_VENDOR) added that variable, but set to its default
value.
This is however not required to define a valid CPE ID, as it also
defines a non-default CPE_ID_PREFIX.
Drop V4L2LOOPBACK_CPE_ID_VENDOR now.
Signed-off-by: Yann E. MORIN <yann.morin.1998@free.fr>
Cc: Fabrice Fontaine <fontaine.fabrice@gmail.com>
Signed-off-by: Peter Korsgaard <peter@korsgaard.com>
(cherry picked from commit 74682e07df)
Signed-off-by: Peter Korsgaard <peter@korsgaard.com>
The symmetric encryption test can sometimes take longer than the default
timeout. This commit increase the timeout to 10 seconds for that
command.
Signed-off-by: Julien Olivain <ju.o@free.fr>
Signed-off-by: Thomas Petazzoni <thomas.petazzoni@bootlin.com>
(cherry picked from commit f44c0807c6)
Signed-off-by: Peter Korsgaard <peter@korsgaard.com>
Buildroot commit 8f1418b5dd bumped the
version of gnupg2 on the next branch causing a build error:
server.c:(.text+0xbf8): undefined reference to `ks_ldap_help_variables'
Signed-off-by: Bernd Kuhls <bernd@kuhls.net>
Signed-off-by: Thomas Petazzoni <thomas.petazzoni@bootlin.com>
(cherry picked from commit 06702c81d3)
Signed-off-by: Peter Korsgaard <peter@korsgaard.com>
/home/autobuild/autobuild/instance-8/output-1/host/lib/gcc/powerpc-buildroot-linux-uclibcspe/8.4.0/../../../../powerpc-buildroot-linux-uclibcspe/bin/ld: warning: conftest has a LOAD segment with RWX permissions
collect2: error: ld returned 1 exit status
[...]
In file included from arith_yylex.c:44:
system.h:74:22: error: static declaration of 'strtod' follows non-static declaration
- AC_DEFINE([USE_LIBPSL], [1], [PSL support enabled])
- ],
- [AC_MSG_ERROR([libpsl was not found]) ]
+dnl Default to compiler & linker defaults for LIBPSL files & libraries.
+OPT_LIBPSL=off
+AC_ARG_WITH(libpsl,dnl
+AS_HELP_STRING([--with-libpsl=PATH],[Where to look for libpsl, PATH points to the LIBPSL installation; when possible, set the PKG_CONFIG_PATH environment variable instead of using this option])
Build on uclibc is broken since version 0.75 and commit
65383082bf0c49cec63f4b36001a40bd9b13edf6 because AT_HWCAP2 is used
even if <sys/auxv.h> is not available:
/home/buildroot/autobuild/run/instance-3/output-1/build/putty-0.80/unix/utils/arm_arch_queries.c: In function 'platform_aes_neon_available':
/home/buildroot/autobuild/run/instance-3/output-1/build/putty-0.80/unix/utils/arm_arch_queries.c:18:22: error: 'AT_HWCAP2' undeclared (first use in this function)
Some files were not shown because too many files have changed in this diff
Show More
Reference in New Issue
Block a user
Blocking a user prevents them from interacting with repositories, such as opening or commenting on pull requests or issues. Learn more about blocking a user.