The prompt and variable name for the OCI "entrypoint arguments" are
somewhat incorrect. Indeed, they are in fact used to set the image
"command". Yet, using "command" would be confusing too, because the
interplay between entrypoint and command is tricky [0].
TL-DR; when both entrrypoint and command are set, command acts as
arguments passed to the entrypoint.
Additionally, we currently can only pass a single item as either
entrypoint or command. This precludes passing actual arguments to the
entrypoint, or passing multiple arguments as command.
For example:
BR2_TARGET_ROOTFS_OCI_ENTRYPOINT="/bin/tini -g -p SIGTERM --"
BR2_TARGET_ROOTFS_OCI_ENTRYPOINT_ARGS="/usr/bin/env sh"
generates an images with (only relevant fields are included below):
{
"config": {
"Entrypoint": [ "/bin/tini -g -p SIGTERM --" ],
"Cmd": [ "/usr/bin/env sh" ]
}
}
This is obviously incorrect, and not what one would expect:
{
"config": {
"Entrypoint": [ "/bin/tini", "-g", "-p", "SIGTERM", "--" ],
"Cmd": [ "/usr/bin/env", "sh" ]
}
}
However, some people do want to be able to pass an actual shell
scriptlet as a command, such as:
{
"config": {
"Entrypoint": [ "/bin/sh", "-c" ],
"Cmd": [ "my shell logic goes here" ]
}
}
Handling both is obviously conflicting: we can't both split-on-spaces
and not-split-on-spaces at the same time...
So, we fix that in two ways:
- make the current _OCI_ENTRYPOINT_ARGS a legacy option, and introduce
the new _OCI_CMD option with different semantics (see below) and an
appropriate prompt;
- we interpret both _OCI_ENTRYPOINT and _OCI_CMD as shell strings,
which we subject to the usual shell quoting [1] and token
recognition [2];
Since _OCI_ENTRYPOINT_ARGS used to be interpreted as a single string, we
can't easily change its meaning to be a space-separated list, as that
would break existing setups, which is the reason we make it legacy and
introduce a new option.
Ideally, we would like to default the new option _OCI_CMD to be the
quoted value of the previous _OCI_ENTRYPOINT_ARGS, but this is not
possible in Kconfig. Still, users that had a _OCI_ENTRYPOINT_ARGS set
will now get an early build error, and can still detect they need to do
something about it.
As for _OCI_ENTRYPOINT, it does not make much sense to support both cases.
Indeed, without splitting on spaces, we'd end up with an entrypoint that
would have a single item:
{
"config": {
"entrypoint: [ "some string with some spaces" ]
}
}
which in this case would try to execute the program which name is
actually "some string with some spaces", so we do not expect that
existing entrypoints are set with any space in them, and so the new
behaviour, unlike for _OCI_ENTRYPOINT_ARGS vs. _OCI_CMD, is compatible
with existing configurations, and so we do not need to make it a legacy
option and introduce a new one.
[0] https://docs.docker.com/engine/reference/builder/#understand-how-cmd-and-entrypoint-interact
[1] https://pubs.opengroup.org/onlinepubs/9699919799/utilities/V3_chap02.html#tag_18_02
[2] https://pubs.opengroup.org/onlinepubs/9699919799/utilities/V3_chap02.html#tag_18_03
Signed-off-by: Yann E. MORIN <yann.morin@orange.com>
Cc: Sergio Prado <sergio.prado@e-labworks.com>
Cc: Matthew Weber <matthew.weber@collins.com>
Signed-off-by: Peter Korsgaard <peter@korsgaard.com>
(cherry picked from commit 08d65d81d8)
Signed-off-by: Peter Korsgaard <peter@korsgaard.com>
duktape can't be used with BR2_OPTIMIZE_FAST resulting in the following
build failure in polkit:
In file included from /nvmedata/autobuild/instance-27/output-1/host/aarch64_be-buildroot-linux-gnu/sysroot/usr/include/duktape.h:202,
from ../src/polkitbackend/polkitbackendduktapeauthority.c:28:
/nvmedata/autobuild/instance-27/output-1/host/aarch64_be-buildroot-linux-gnu/sysroot/usr/include/duk_config.h:2893:2: error: #error __FAST_MATH__ defined, refusing to compile
2893 | #error __FAST_MATH__ defined, refusing to compile
| ^~~~~
Fixes:
- http://autobuild.buildroot.org/results/587485bcfd85dfd974608aa00b9bd0c42a3a61d8
Signed-off-by: Fabrice Fontaine <fontaine.fabrice@gmail.com>
Signed-off-by: Peter Korsgaard <peter@korsgaard.com>
(cherry picked from commit c1dcf18c8d)
Signed-off-by: Peter Korsgaard <peter@korsgaard.com>
The upstream Makefile failed to detect systemd being present in some (maybe all)
builds, resulting in the unit file not being installed. Without the unit file,
the udev rules in usb_modeswitch-data don't work as expected (no modeswitch is
performed).
This commit adds a patch that modifies the Makefile to include
'$(PREFIX)/bin/systemctl' in the list of paths checked, which makes the
installation phase work as intended. I will also submit this patch upstream.
Signed-off-by: Sol Bekic <s+removethis@s-ol.nu>
Signed-off-by: Yann E. MORIN <yann.morin.1998@free.fr>
(cherry picked from commit c6b746e6fc)
Signed-off-by: Peter Korsgaard <peter@korsgaard.com>
libks needs NPTL since its addition in commit
5752d18bfc:
/nvmedata/autobuild/instance-17/output-1/build/libks-1.8.0/src/ks_thread.c: In function 'thread_launch':
/nvmedata/autobuild/instance-17/output-1/build/libks-1.8.0/src/ks_thread.c:237:21: error: 'pthread_setname_np' undeclared (first use in this function); did you mean 'pthread_setcanceltype'?
237 | if (thread->tag && pthread_setname_np)
| ^~~~~~~~~~~~~~~~~~
| pthread_setcanceltype
Fixes:
- http://autobuild.buildroot.org/results/8a93b75ee51e005383eac17aa7577b43eda4cd92
Signed-off-by: Fabrice Fontaine <fontaine.fabrice@gmail.com>
Signed-off-by: Peter Korsgaard <peter@korsgaard.com>
(cherry picked from commit 91600a62af)
Signed-off-by: Peter Korsgaard <peter@korsgaard.com>
Fix CVE-2022-24882: FreeRDP is a free implementation of the Remote
Desktop Protocol (RDP). In versions prior to 2.7.0, NT LAN Manager
(NTLM) authentication does not properly abort when someone provides and
empty password value. This issue affects FreeRDP based RDP Server
implementations. RDP clients are not affected. The vulnerability is
patched in FreeRDP 2.7.0. There are currently no known workarounds.
Fix CVE-2022-24883: FreeRDP is a free implementation of the Remote
Desktop Protocol (RDP). Prior to version 2.7.0, server side
authentication against a `SAM` file might be successful for invalid
credentials if the server has configured an invalid `SAM` file path.
FreeRDP based clients are not affected. RDP server implementations using
FreeRDP to authenticate against a `SAM` file are affected. Version 2.7.0
contains a fix for this issue. As a workaround, use custom
authentication via `HashCallback` and/or ensure the `SAM` database path
configured is valid and the application has file handles left.
https://github.com/FreeRDP/FreeRDP/releases/tag/2.7.0
Signed-off-by: Fabrice Fontaine <fontaine.fabrice@gmail.com>
Signed-off-by: Peter Korsgaard <peter@korsgaard.com>
(cherry picked from commit ecaca2d01e)
Signed-off-by: Peter Korsgaard <peter@korsgaard.com>
Recent commit f0c7cb01a9 (package/pkg-download: do not try to vendor
_EXTRA_DOWNLOADS) got last-minute changes when applied, which changed
the expected behaviour for packages that do not have a main download.
Before f0c7cb01a9, the dl-wrapper would not even be called for those
packages, and the original patch that was sent also avoided downloading
such packages, but f0c7cb01a9 now causes the dl-wrapper to be called.
It is however an accident that the dl-wrapper does not fail. Indeed, it
is expected to fail if no download was successful; we pass no URI, so
the dl-wrapper should have failed, as it basically does:
download_and_check=0
for uri in "${uris[@]}"; do
...
done
if [ "${download_and_check}" -eq 0 ]; then
exit 1
fi
However, it does not even go that far...
Even though there is no output file, we still pass the path to the
package output directory as the output path. So, to avoid downloading
files already present, the wrapper checks if the output file exists,
and checks its hash:
if [ -e "${output}" ]; then
if support/download/check-hash ${quiet} "${hfile}" "${output}" ...
exit 0
...
fi
The output path does exist now, because we explicitly create it just
before calling the wrapper, because that's where we also locate the
lockfile.
So it ends up trying to validate the hash of a directory, but it fails
to, as there is indeed no hash file for that package. And a missing hash
file is just a warning, not an error, which makes the download actually
a success...
So, this is currently working, and this is by pure luck.
However, there is a potential issue: if a target package is a virtual
package, but the host package is a real package, e.g. the same foo.mk
does (or the other way around):
HOST_FOO_VERSION = 1.2.3
HOST_FOO_SITE = http://example.net/
$(eval $(virtual-package))
$(eval $(host-generic-package))
If there is a hash file to validate the host download, then the current
situation will cause a failure, because there would be a hash file, but
no hash for the output path of the target variant, which would then be
a hard-error.
So, revert to the behaviour from before f0c7cb01a9, where no download
is attempted for a package without a source (really, without a main
download, now).
Signed-off-by: Yann E. MORIN <yann.morin@orange.com>
Cc: Arnout Vandecappelle (Essensium/Mind) <arnout@mind.be>
Signed-off-by: Arnout Vandecappelle (Essensium/Mind) <arnout@mind.be>
(cherry picked from commit d95a6dac31)
Signed-off-by: Peter Korsgaard <peter@korsgaard.com>
The default defconfig target for the 64 bit powerpc kernel is
ppc64_defconfig, the big endian configuration.
When building for powerpc64le users want the little endian kernel as
they can't boot LE userspace on a BE kernel.
Fix up the defconfig used in this case. This will avoid the following
autobuilder failure:
VDSO32A arch/powerpc/kernel/vdso32/sigtramp.o
cc1: error: ‘-m32’ not supported in this configuratioin
make[4]: *** [arch/powerpc/kernel/vdso32/Makefile:49: arch/powerpc/kernel/vdso32/sigtramp.o] Error 1
http://autobuild.buildroot.net/results/dd76d53bab56470c0b83e296872d7bb90f9e8296/
Note that the failure indicates the toolchain is configured to disable
the 32 bit target, causing the kernel to fail when building the 32 bit
VDSO. This is only a problem on the BE kernel as the LE kernel disables
CONFIG_COMPAT, aka 32 bit userspace support, by default.
Signed-off-by: Joel Stanley <joel@jms.id.au>
Signed-off-by: Arnout Vandecappelle (Essensium/Mind) <arnout@mind.be>
(cherry picked from commit 62044e8675)
Signed-off-by: Peter Korsgaard <peter@korsgaard.com>
Bump package revision to pull various fixes for v5.1 - v5.17 kernels.
Patch that disables verbose debug is no more compatible with updated
driver since build flags in Makefile has been changed. Drop it.
Signed-off-by: Sergey Matyukevich <geomatsi@gmail.com>
Signed-off-by: Arnout Vandecappelle (Essensium/Mind) <arnout@mind.be>
(cherry picked from commit 25956b29e4)
Signed-off-by: Peter Korsgaard <peter@korsgaard.com>
numactl unconditionally uses __atomic_fetch_and resulting in the
following build failure on architectures that need libatomic to provide
atomic intrinsics (e.g. microblaze) since commit
4ed540ddf5:
/nvmedata/autobuild/instance-5/output-1/host/lib/gcc/microblaze-buildroot-linux-uclibc/10.3.0/../../../../microblaze-buildroot-linux-uclibc/bin/ld: ./.libs/libnuma.a(libnuma.o): in function `numa_node_to_cpus_v1':
(.text+0x2a34): undefined reference to `__atomic_fetch_and_1'
Fixes:
- http://autobuild.buildroot.org/results/e225cb83dae390d9dc543d4da85c52180efbd40a
Signed-off-by: Fabrice Fontaine <fontaine.fabrice@gmail.com>
Signed-off-by: Arnout Vandecappelle (Essensium/Mind) <arnout@mind.be>
(cherry picked from commit 5ade3ecdb8)
Signed-off-by: Peter Korsgaard <peter@korsgaard.com>
As reported by [1], the lxc test is broken since lxc >= 4.0.11.
A patch was added to lxc 4.0.11 to use the new mount api for devpts
setup [2] but the fall back code doesn't work when this new mount
API is not supported. This API was added in kernel 5.6.
(kernel 5.5)
DEBUG conf - conf.c:lxc_setup_devpts_child:1682 - No new devpts instance will be
mounted since no pts devices are required
lxc-start lxc_iperf3 DEBUG conf - conf.c:lxc_setup_dev_console:1966 - Cleared
all (0) mounts from "/dev/console"
lxc-start lxc_iperf3 ERROR mount_utils - mount_utils.c:mount_at:661 - No such
file or directory - Failed to mount "/proc/self/fd/44" to "/proc/self/fd/43"
lxc-start lxc_iperf3 ERROR conf - conf.c:lxc_setup_dev_console:1988 - No such
file or directory - Failed to mount "10(/dev/pts/0)" on "43"
lxc-start lxc_iperf3 ERROR conf - conf.c:lxc_setup_console:2143 - No such file
or directory - Failed to setup console
(kernel 5.6)
lxc-start lxc_iperf3 TRACE mount_utils - mount_utils.c:can_use_mount_api:582 -
Kernel supports mount api
lxc-start lxc_iperf3 TRACE mount_utils - mount_utils.c:move_detached_mount:328
- Attach detached mount 45 to filesystem at 43
lxc-start lxc_iperf3 TRACE conf - conf.c:lxc_setup_dev_console:1990 - Setup
console "/dev/pts/0"
Bump the kernel to the current LTS 5.15.38 version that fully support the
mount API needed by lxc.
Fixes:
https://gitlab.com/buildroot.org/buildroot/-/jobs/2429013708
[1] http://lists.busybox.net/pipermail/buildroot/2022-January/635251.html
[2] https://github.com/lxc/lxc/commit/be606e16fd0fa967219d890745a425625eafe251
Signed-off-by: Romain Naour <romain.naour@gmail.com>
Cc: Fabrice Fontaine <fontaine.fabrice@gmail.com>
Signed-off-by: Yann E. MORIN <yann.morin.1998@free.fr>
(cherry picked from commit ca135c9939)
Signed-off-by: Peter Korsgaard <peter@korsgaard.com>
Since the very beginning, libunistring was a mandatory dependency of
gnutls. However, it would use its internal copy if libunistring was not
selected. We never want that, so make libunistring an actual mandatory
dependency.
Signed-off-by: Arnout Vandecappelle (Essensium/Mind) <arnout@mind.be>
Signed-off-by: Yann E. MORIN <yann.morin.1998@free.fr>
(cherry picked from commit 3292f87412)
Signed-off-by: Peter Korsgaard <peter@korsgaard.com>
Version 3.7.4 added compression options with brotli, zlib and zstd.
These are automatically discovered, which makes their inclusion depend
on the build order. Therefore, explicitly enable/disable them.
Note that the configure help text says "--without-brotli" and
"--without-zstd", but the options are actually --without-libbrotli and
--without-libzstd. --without-zlib is correct in the help text.
Signed-off-by: Arnout Vandecappelle (Essensium/Mind) <arnout@mind.be>
Signed-off-by: Yann E. MORIN <yann.morin.1998@free.fr>
(cherry picked from commit 91354636e6)
Signed-off-by: Peter Korsgaard <peter@korsgaard.com>
The option is set a few lines below depending on
BR2_PACKAGE_GNUTLS_OPENSSL.
Signed-off-by: Arnout Vandecappelle (Essensium/Mind) <arnout@mind.be>
[yann.morin.1998@free.fr: move it all under a single conditional block]
Signed-off-by: Yann E. MORIN <yann.morin.1998@free.fr>
(cherry picked from commit 91b10ec79a)
Signed-off-by: Peter Korsgaard <peter@korsgaard.com>
The pcre/libregex dependency was removed in version 3.7.3 with upstream
commit 26578b7d02c269ff1d34ff782d84c7667734d03d, which removed the
bundled libopts. Remove the pcre dependency and the relevant CONF_OPTS
handling.
Signed-off-by: Arnout Vandecappelle (Essensium/Mind) <arnout@mind.be>
Signed-off-by: Yann E. MORIN <yann.morin.1998@free.fr>
(cherry picked from commit 00a046e455)
Signed-off-by: Peter Korsgaard <peter@korsgaard.com>
gnutls's configure script has a weird approach where it first searches
for dependent libraries in the path specified by --prefix, before
searching in the default search path. Since we set --prefix to /usr,
and it doesn't take into account DESTDIR (which is anyway not set at
configure time), that means it will first search /usr/lib before
searching $(STAGING_DIR)/usr/lib.
Ideally, this would be fixed in the configure script itself. However,
the m4 file that does this is pretty complex, it's not immediately clear
where to add $DESTDIR. In addition it comes from gnulib which is a
somewhat annoying upstream.
Therefore, instead, bypass the prefix lookup with
--without-libfoo-prefix. Note that we could set
--with-libfoo-prefix=$(STAGING_DIR)/usr (the latter is already done for
librt and libpthread), but that's pretty pointless -
--without-libfoo-prefix in fact reverts to what should have been done in
the first place, i.e. use the toolchain search path.
Add --without-libfoo-prefix for all options defined in configure (found
with ./configure --help | grep without-.*-prefix). Most of these are
only used in tests (e.g. libcrypto) or even not at all (e.g. libiconv),
but it's fairly hard to discover this and to be sure that they are
indeed not needed, so better pass all of them.
Remove the now-redundant arguments for librt and libpthread.
Add a comment to remind people to revisit these when bumping the
version.
Signed-off-by: Arnout Vandecappelle (Essensium/Mind) <arnout@mind.be>
Cc: Peter Korsgaard <peter@korsgaard.com>
Signed-off-by: Yann E. MORIN <yann.morin.1998@free.fr>
(cherry picked from commit b707a67daa)
Signed-off-by: Peter Korsgaard <peter@korsgaard.com>
One per line, and alphabetical (was already the case for host).
Signed-off-by: Arnout Vandecappelle (Essensium/Mind) <arnout@mind.be>
[yann.morin.1998@free.fr: all host dependencies first]
Signed-off-by: Yann E. MORIN <yann.morin.1998@free.fr>
(cherry picked from commit fb5aad3024)
Signed-off-by: Peter Korsgaard <peter@korsgaard.com>
Includes security fixes to the syscall package, as well as bug fixes to the
compiler, runtime, and the crypto/x509 and net/http/httptest packages.
Signed-off-by: Peter Korsgaard <peter@korsgaard.com>
Fixes:
http://autobuild.buildroot.net/results/a6c7dd171529e2a7b7a26af8d99bec53117a7a02/
Commit fd5842a1dd (boot/shim: add
BR2_PACKAGE_SHIM_ARCH_SUPPORTS) added explicit support for big/little endian
arm/aarch64, but the shim code is hard coded for little endian:
head -n 1 elf_{arm,aarch64}_efi.lds
==> elf_arm_efi.lds <==
OUTPUT_FORMAT("elf32-littlearm", "elf32-littlearm", "elf32-littlearm")
==> elf_aarch64_efi.lds <==
OUTPUT_FORMAT("elf64-littleaarch64", "elf64-littleaarch64", "elf64-littleaarch64")
So drop the support for the big endian variants.
Signed-off-by: Peter Korsgaard <peter@korsgaard.com>
(cherry picked from commit 0ebbf0b280)
Signed-off-by: Peter Korsgaard <peter@korsgaard.com>
An out-of-bounds read/write vulnerability was found in e2fsprogs 1.46.5.
This issue leads to a segmentation fault and possibly arbitrary code
execution via a specially crafted filesystem.
Signed-off-by: Fabrice Fontaine <fontaine.fabrice@gmail.com>
Signed-off-by: Peter Korsgaard <peter@korsgaard.com>
(cherry picked from commit 3ef096786a)
Signed-off-by: Peter Korsgaard <peter@korsgaard.com>
This patch fixes the DP audio and video PLL configurations for the
zynqmp-zcu106-revA evaluation board.
The Linux DP driver expects the DP to be using the following PLL config:
- DP video PLL should use the VPLL (0x0)
- DP audio PLL should use the RPLL (0x3)
Register 0xFD1A0070 configures the DP video PLL.
Register 0xFD1A0074 configures the DP audio PLL.
This patch was build and run tested on a zynqmp-zcu106-revA target board.
Upstream-Status: submitted (https://lore.kernel.org/all/62538b4a04dee28a6fc8ac5b85f8c845a5a76aa4.1651740988.git.michal.simek@amd.com/)
This patch will be removed from buildroot in a future release when no longer necessary.
Signed-off-by: Neal Frager <neal.frager@amd.com>
Signed-off-by: Peter Korsgaard <peter@korsgaard.com>
(cherry picked from commit 8125300088)
Signed-off-by: Peter Korsgaard <peter@korsgaard.com>
Recent changes in libusb have exposed a bug in OpenOCD which now crash when trying
to use the ST-Link driver.
Upstream has a fix as commit cff0e417da58adef1ceef9a63a99412c2cc87ff3. This add the commit
as a stand alone patch. The crash also happen on Linux, which was not mentionned in that
commit message.
Should be removed when OpenOCD is updated to a release newer than 0.11
Signed-off-by: Yannick Brosseau <yannick.brosseau@gmail.com>
Signed-off-by: Arnout Vandecappelle (Essensium/Mind) <arnout@mind.be>
(cherry picked from commit 4239958963)
Signed-off-by: Peter Korsgaard <peter@korsgaard.com>
For golang- or cargo-based packages, we apply a vendoring pass after the
package's "main" download is done. Whether to vendor or not is based on
the heuristic that a specific directory exists or not; for golang
packages, we look for '/vendor', while for cargo, we look for '/VENDOR'.
This is fine for the "main" (by lack of a better term) download, but
this falls flat on its face for extra downloads. Indeed, some packages
may need to download data sets, or assets, as _EXTRA_DOWNLOADS. Those
are usually just data blobs, and are not actual golang or cargo packages;
as such they do not need to be vendored, but worse, if we try to
actually vendor them, this fails because the required files for
vendoring are missing from the archives in such data sets.
We fix that by decoupling the download for the extra download, from the
download for the main archive. We pass the post-processing option only
to the main download.
This makes the hard assumption that extra downloads will never need to
be post-processed for vendoring, of course; we hope this will always be
correct in practice. If not, we can fix it later.
Signed-off-by: Yann E. MORIN <yann.morin@orange.com>
Cc: Thomas Petazzoni <thomas.petazzoni@bootlin.com>
[Arnout:
- no loop needed for MAIN_DOWNLOAD, it can have only one;
- remove superfluous backslash in the definition of MAIN_DOWNLOAD;
- introduce _ADDITIONAL_DOWNLOADS to avoid filter-out.]
Signed-off-by: Arnout Vandecappelle (Essensium/Mind) <arnout@mind.be>
(cherry picked from commit f0c7cb01a9)
Signed-off-by: Peter Korsgaard <peter@korsgaard.com>
This was already disabled for target packages in:
12ba356365
We need to disable wrap downloads for host meson packages as well.
Signed-off-by: James Hilliard <james.hilliard1@gmail.com>
Signed-off-by: Arnout Vandecappelle (Essensium/Mind) <arnout@mind.be>
(cherry picked from commit 5c2f0c698c)
Signed-off-by: Peter Korsgaard <peter@korsgaard.com>
This patch bumps configs/zynqmp_zcu106_defconfig pmufw to 2022.1.
The pm_cfg_obj.c has not changed between 2021.2 and 2022.1.
The pmufw_v2022.1.bin has been tested on a zcu106 board.
Signed-off-by: Neal Frager <neal.frager@amd.com>
Reviewed-by: Luca Ceresoli <luca@lucaceresoli.net>
Signed-off-by: Peter Korsgaard <peter@korsgaard.com>
(cherry picked from commit 27c672e53a)
Signed-off-by: Peter Korsgaard <peter@korsgaard.com>
This patch bumps configs/zynqmp_zcu102_defconfig pmufw to 2022.1.
The pm_cfg_obj.c has not changed between 2021.2 and 2022.1.
The pmufw_v2022.1.bin has been tested on a zcu102 board.
Signed-off-by: Neal Frager <neal.frager@amd.com>
Reviewed-by: Luca Ceresoli <luca@lucaceresoli.net>
Signed-off-by: Peter Korsgaard <peter@korsgaard.com>
(cherry picked from commit b044be10f1)
Signed-off-by: Peter Korsgaard <peter@korsgaard.com>
Fixes the following security issues:
- The c_rehash script allows command injection (CVE-2022-1292)
The c_rehash script does not properly sanitise shell metacharacters to
prevent command injection. This script is distributed by some operating
systems in a manner where it is automatically executed. On such operating
systems, an attacker could execute arbitrary commands with the privileges of
the script.
Use of the c_rehash script is considered obsolete and should be replaced by
the OpenSSL rehash command line tool.
https://www.openssl.org/news/secadv/20220503.txt
Signed-off-by: Peter Korsgaard <peter@korsgaard.com>
Signed-off-by: Arnout Vandecappelle (Essensium/Mind) <arnout@mind.be>
(cherry picked from commit 96a4aee289)
Signed-off-by: Peter Korsgaard <peter@korsgaard.com>
This patch migrates configs/zynqmp_zcu106_defconfig to tarballs for TF-A, u-boot and Linux.
This patch has zero change in code running on the device.
The goal is to improve build speed and align with the zynq_xxx_defconfigs.
Signed-off-by: Neal Frager <neal.frager@amd.com>
Signed-off-by: Peter Korsgaard <peter@korsgaard.com>
(cherry picked from commit ac05c0d68d)
Signed-off-by: Peter Korsgaard <peter@korsgaard.com>
This patch migrates configs/zynqmp_zcu102_defconfig to tarballs for TF-A, u-boot and Linux.
This patch has zero change in code running on the device.
The goal is to improve build speed and align with the zynq_xxx_defconfigs.
Signed-off-by: Neal Frager <neal.frager@amd.com>
Signed-off-by: Peter Korsgaard <peter@korsgaard.com>
(cherry picked from commit 56539c5c93)
Signed-off-by: Peter Korsgaard <peter@korsgaard.com>
We can't enable lua and luajit at the same time as they both provide
the virtual luainterpreter package.
Fixes:
package/luajit/luajit.mk:80: *** Configuration error: both "luajit" and "lua" are selected as providers for virtual package "luainterpreter". Only one provider can be selected at a time. Please fix your configuration. Stop.
Signed-off-by: James Hilliard <james.hilliard1@gmail.com>
Signed-off-by: Arnout Vandecappelle (Essensium/Mind) <arnout@mind.be>
(cherry picked from commit e11431dd61)
Signed-off-by: Peter Korsgaard <peter@korsgaard.com>
Fixes the following security issues:
- CVE-2022-29824] Integer overflow in xmlBuf and xmlBuffer
- Fix potential double-free in xmlXPtrStringRangeFunction
- Fix memory leak in xmlFindCharEncodingHandler
- Normalize XPath strings in-place
- Prevent integer-overflow in htmlSkipBlankChars() and xmlSkipBlankChars() (David Kilzer)
- Fix leak of xmlElementContent (David Kilzer)
For more details, see the release notes:
https://gitlab.gnome.org/GNOME/libxml2/-/releases/v2.9.14
Signed-off-by: James Hilliard <james.hilliard1@gmail.com>
Signed-off-by: Arnout Vandecappelle (Essensium/Mind) <arnout@mind.be>
(cherry picked from commit 4dd01598c2)
Signed-off-by: Peter Korsgaard <peter@korsgaard.com>
Currently pillow doesn't correctly search pkg-config system paths
for some libraries which can prevent some libraries from being
properly detected/enabled in pillow.
This is due to pillow implementing custom header validation
checks which need system paths present to function correctly:
https://github.com/python-pillow/Pillow/blob/9.0.1/setup.py#L633
Removed custom BUILD_CMDS and INSTALL_TARGET_CMDS which were
causing python-pillow to be installed for the host, they are
not required, we just need to set build_ext at the start
of PYTHON_PILLOW_BUILD_OPTS instead.
Signed-off-by: James Hilliard <james.hilliard1@gmail.com>
Signed-off-by: Arnout Vandecappelle (Essensium/Mind) <arnout@mind.be>
(cherry picked from commit 10664068b9)
Signed-off-by: Peter Korsgaard <peter@korsgaard.com>
This patch bumps configs/zynqmp_zcu106_defconfig to Xilinx software release 2022.1
which includes the following updates:
- TF-A release version 2.6
- U-Boot release version 2022.01
- Linux kernel release version 5.15.19
It is better to use a Xilinx official release version than sha tags.
Signed-off-by: Neal Frager <neal.frager@amd.com>
Reviewed-by: Luca Ceresoli <luca@lucaceresoli.net>
Reviewed-by: Luca Ceresoli <luca@lucaceresoli.net>
Signed-off-by: Peter Korsgaard <peter@korsgaard.com>
(cherry picked from commit df0a0ae9d9)
Signed-off-by: Peter Korsgaard <peter@korsgaard.com>
This patch bumps configs/zynqmp_zcu102_defconfig to Xilinx software release 2022.1
which includes the following updates:
- TF-A release version 2.6
- U-Boot release version 2022.01
- Linux kernel release version 5.15.19
It is better to use a Xilinx official release version than sha tags.
Signed-off-by: Neal Frager <neal.frager@amd.com>
Signed-off-by: Peter Korsgaard <peter@korsgaard.com>
(cherry picked from commit b935f46a9b)
Signed-off-by: Peter Korsgaard <peter@korsgaard.com>
Github rockchip-linux doesn't provide libmali repository anymore and the
only up-to-date and maintained repository I've found is JeffyCN/mirrors
branch libmali that provide the identical situtation we were at with
previous repository, so let's switch to JeffyCN repository. This fixes
a build failure while trying to install rockchip-mali.
Signed-off-by: Giulio Benetti <giulio.benetti@benettiengineering.com>
Signed-off-by: Arnout Vandecappelle (Essensium/Mind) <arnout@mind.be>
(cherry picked from commit 8c25838b53)
Signed-off-by: Peter Korsgaard <peter@korsgaard.com>
CONFIG_CRYPTO_AEAD2=y.
CONFIG_CRYPTO_AEAD2 and CONFIG_CRYPTO_SKCIPHER2 are needed to fix the
following build failure:
ERROR: modpost: "crypto_alloc_skcipher" [/home/autobuild/autobuild/instance-2/output-1/build/cryptodev-linux-1.12/./cryptodev.ko] undefined!
ERROR: modpost: "scatterwalk_map_and_copy" [/home/autobuild/autobuild/instance-2/output-1/build/cryptodev-linux-1.12/./cryptodev.ko] undefined!
ERROR: modpost: "crypto_ahash_final" [/home/autobuild/autobuild/instance-2/output-1/build/cryptodev-linux-1.12/./cryptodev.ko] undefined!
ERROR: modpost: "crypto_aead_encrypt" [/home/autobuild/autobuild/instance-2/output-1/build/cryptodev-linux-1.12/./cryptodev.ko] undefined!
ERROR: modpost: "crypto_aead_setkey" [/home/autobuild/autobuild/instance-2/output-1/build/cryptodev-linux-1.12/./cryptodev.ko] undefined!
ERROR: modpost: "crypto_skcipher_decrypt" [/home/autobuild/autobuild/instance-2/output-1/build/cryptodev-linux-1.12/./cryptodev.ko] undefined!
ERROR: modpost: "crypto_destroy_tfm" [/home/autobuild/autobuild/instance-2/output-1/build/cryptodev-linux-1.12/./cryptodev.ko] undefined!
ERROR: modpost: "crypto_skcipher_setkey" [/home/autobuild/autobuild/instance-2/output-1/build/cryptodev-linux-1.12/./cryptodev.ko] undefined!
ERROR: modpost: "crypto_aead_decrypt" [/home/autobuild/autobuild/instance-2/output-1/build/cryptodev-linux-1.12/./cryptodev.ko] undefined!
ERROR: modpost: "crypto_aead_setauthsize" [/home/autobuild/autobuild/instance-2/output-1/build/cryptodev-linux-1.12/./cryptodev.ko] undefined!
However, those options are not user-selectable. They are enabled by the
appropriate consumers of those cyphers. Since cryptodev is anyway meant
to give userspace access to kernel crypto (hardware), it makes sense to
enable CONFIG_CRYPTO. The easiest way to also get AEAD2 and SKCIPHER2 is
to enable CONFIG_CRYPTO_USER_API_AEAD as well.
Fixes:
- http://autobuild.buildroot.org/results/a06708369c233f6e60a1a3ffd7a77a4edd932c9a
Signed-off-by: Fabrice Fontaine <fontaine.fabrice@gmail.com>
Signed-off-by: Arnout Vandecappelle (Essensium/Mind) <arnout@mind.be>
(cherry picked from commit 4b12336d1f)
Signed-off-by: Peter Korsgaard <peter@korsgaard.com>
Changelog: https://curl.se/changes.html
Updated license hash due to copyright year bump:
https://github.com/curl/curl/commit/0409192b1fde6b7a4f09667e80ca5dc555eab3f1
The NSS crypto backend requires a special option now, without it
configure errors out with:
configure: error: NSS use must be confirmed using --with-nss-deprecated. NSS support will be dropped from curl in August 2022. See docs/DEPRECATE.md
Since it will be removed entirely soon anyway, and since this version
doesn't fix any CVEs so doesn't need to be backported to stable
branches, drop the NSS option entirely.
Since NSS is going to be removed soon, drop the --without-nss as well.
It is never going to be enabled automatically.
Signed-off-by: Bernd Kuhls <bernd.kuhls@t-online.de>
[Arnout: drop NSS option entirely, as suggested by Baruch Siach.]
Signed-off-by: Arnout Vandecappelle (Essensium/Mind) <arnout@mind.be>
(cherry picked from commit 8afb945bf0)
Signed-off-by: Peter Korsgaard <peter@korsgaard.com>
This reverts commit 8e91385a2c.
This commit is incorrect, as it is perfectly valid for
BR2_TOOLCHAIN_EXTERNAL_PATH to be empty. The help text of
BR2_TOOLCHAIN_EXTERNAL_PATH even documents it as a supported case:
If empty, the compiler will be searched in $PATH.
Commit 392b0a26f5 ("toolchain-external:
default BR2_TOOLCHAIN_EXTERNAL_PATH to empty") even made that the
default saying "In addition, it in fact works correctly when it is
empty. In that case, the toolchain will be searched in PATH."
A user has reported that commit
8945ba4948 (the backport of 8e91385a2c to
the 2022.02.x LTS branch) breaks his use-case:
https://lore.kernel.org/buildroot/CADBnMvhgaozAgZgy3njckjL1i0U6bZ0fLrq-kdFF-qpGhFWgmw@mail.gmail.com/
Reported-by: Kristof Havasi <havasiefr@gmail.com>
Signed-off-by: Thomas Petazzoni <thomas.petazzoni@bootlin.com>
[yann.morin.1998@free.fr: reference 8e91385a2c on master]
Signed-off-by: Yann E. MORIN <yann.morin.1998@free.fr>
(cherry picked from commit 77fc458025)
Signed-off-by: Peter Korsgaard <peter@korsgaard.com>
Thanks to the bump of elf2flt to version 2021.08, the issue with
recent versions of binutils has been fixed, so we can re-enable using
the recent binutils versions.
Signed-off-by: Thomas Petazzoni <thomas.petazzoni@bootlin.com>
Signed-off-by: Yann E. MORIN <yann.morin.1998@free.fr>
(cherry picked from commit 44b9361a2e)
Signed-off-by: Peter Korsgaard <peter@korsgaard.com>
It contains several fixes and improvements compared to our current
version, and two of our patches have been accepted upstream. Most
notably, it fixes the issue we had in using elf2flt with recent
versions of binutils (upstream commit
ba379d08bb78c9300e84351c11080c26ddcc36b3).
Patch 0001-ld-elf2flt-behave-properly-when-called-with-a-name-d.patch
is upstream as of commit 1c9b454336eaf38f7d037917a3120fae04193fbe
Patch 0002-elf2flt.c-add-new-relocation-types-for-xtensa.patch is
upstream as of commit d7eb73163bcea31168c438fc132a0967ac172e3d
The other two patches are refreshed to apply properly on 2021.08.
Signed-off-by: Thomas Petazzoni <thomas.petazzoni@bootlin.com>
Signed-off-by: Yann E. MORIN <yann.morin.1998@free.fr>
(cherry picked from commit 65d78dcfeb)
Signed-off-by: Peter Korsgaard <peter@korsgaard.com>
The afboot-stm32 build system was initially linking with gcc, but that
was changed upstream following a Buildroot contribution to use ld
instead.
However, the build system was still passing -nostartfiles, which is a
gcc option. By luck, this option was simply ignored by older versions
of ld (such as binutils 2.32), but newer versions of ld (2.36 and
newer, at least) no longer accept/ignore this option.
This commit adds a patch that drops the use of this option, since it
is useless for ld.
The first patch is slightly updated because the upstream pull request
has been updated to contain both build fixes.
Signed-off-by: Thomas Petazzoni <thomas.petazzoni@bootlin.com>
Signed-off-by: Yann E. MORIN <yann.morin.1998@free.fr>
(cherry picked from commit cf5206ea98)
Signed-off-by: Peter Korsgaard <peter@korsgaard.com>
Fix CVE-2022-1381: global heap buffer overflow in skip_range in GitHub
repository vim/vim prior to 8.2.4763. This vulnerability is capable of
crashing software, Bypass Protection Mechanism, Modify Memory, and
possible remote execution
Signed-off-by: Fabrice Fontaine <fontaine.fabrice@gmail.com>
Signed-off-by: Thomas Petazzoni <thomas.petazzoni@bootlin.com>
(cherry picked from commit 8c76fc9d1c)
Signed-off-by: Peter Korsgaard <peter@korsgaard.com>
HPA's tftp server init script does not support include of a
configuration file. So changing daemon parameters would cause
a modification of the init script.
Similar to NFS, dropbear, DHCP, SNMP and other network services
in buildroot, this patch adds an include of /etc/default/tftpd
to the init script. So any user can change the default behaviour
by adding its own configuration file instead of changing the init
script.
Signed-off-by: Andreas Ehmanns <universeiii@gmx.de>
Signed-off-by: Yann E. MORIN <yann.morin.1998@free.fr>
(cherry picked from commit 61bfaf0354)
Signed-off-by: Peter Korsgaard <peter@korsgaard.com>
Moved groups render and sgx from UDEV_USERS to SYSTEMD_USERS as they
currently only appear in systemd's udev rules.
In systemd, group render was introduced since commit 4e15a73, and group
sgx was introduced since commit c9c4899.
In eudev, group render was introduced since commit bb070c1, but was
removed since commit a8ffcd1 [1].
[1]: https://github.com/eudev-project/eudev/issues/160
Signed-off-by: TIAN Yuanhao <tianyuanhao3@163.com>
Cc: Arnout Vandecappelle (Essensium/Mind) <arnout@mind.be>
Cc: Carlos Santos <unixmania@gmail.com>
Cc: Yann E. MORIN <yann.morin.1998@free.fr>
Signed-off-by: Yann E. MORIN <yann.morin.1998@free.fr>
(cherry picked from commit 6d163e12a4)
Signed-off-by: Peter Korsgaard <peter@korsgaard.com>
On m68k building with optimizations results in failures such as:
/tmp/cckiMnG5.s: Assembler messages:
/tmp/cckiMnG5.s:142572: Error: value -39206 out of range
/tmp/cckiMnG5.s:142629: Error: value -40282 out of range
/tmp/cckiMnG5.s:146408: Error: value -53294 out of range
/tmp/cckiMnG5.s:159014: Error: value -39206 out of range
/tmp/cckiMnG5.s:159071: Error: value -40282 out of range
/tmp/cckiMnG5.s:162850: Error: value -53294 out of range
/tmp/cckiMnG5.s:175456: Error: value -39206 out of range
/tmp/cckiMnG5.s:175513: Error: value -40282 out of range
/tmp/cckiMnG5.s:179292: Error: value -53294 out of range
/tmp/cckiMnG5.s:191898: Error: value -39206 out of range
/tmp/cckiMnG5.s:191955: Error: value -40282 out of range
/tmp/cckiMnG5.s:195734: Error: value -53294 out of range
These only appear when building with -O2, the smaller code generated
with -Os does not cause trouble, so workaround by using that.
Fixes:
http://autobuild.buildroot.net/results/2f222d5a86b4237b81ca31dba89f58b0e6e879db/
Signed-off-by: Adrian Perez de Castro <aperez@igalia.com>
Signed-off-by: Arnout Vandecappelle (Essensium/Mind) <arnout@mind.be>
(cherry picked from commit 8915f51cc0)
Signed-off-by: Peter Korsgaard <peter@korsgaard.com>
Force LibUSB_VERSION_1.0 to ON to fix the following static build failure
with libusb and libatomic:
-- Looking for libusb_get_device_list in /nvmedata/autobuild/instance-4/output-1/host/sparc-buildroot-linux-uclibc/sysroot/usr/lib/libusb-1.0.a
-- Looking for libusb_get_device_list in /nvmedata/autobuild/instance-4/output-1/host/sparc-buildroot-linux-uclibc/sysroot/usr/lib/libusb-1.0.a - not found
[...]
/nvmedata/autobuild/instance-4/output-1/build/openobex-1.7.2/lib/transport/usbobex.h:30:10: fatal error: usb.h: No such file or directory
30 | #include <usb.h>
| ^~~~~~~
Fixes:
- http://autobuild.buildroot.org/results/52b0edc4278f65fb4a9671b65c655cc4544a3103
Signed-off-by: Fabrice Fontaine <fontaine.fabrice@gmail.com>
Signed-off-by: Arnout Vandecappelle (Essensium/Mind) <arnout@mind.be>
(cherry picked from commit d608368e1a)
Signed-off-by: Peter Korsgaard <peter@korsgaard.com>
Fix the following static build failure:
/nvmedata/autobuild/instance-15/output-1/per-package/ltp-testsuite/host/bin/../lib/gcc/mipsel-buildroot-linux-uclibc/10.3.0/../../../../mipsel-buildroot-linux-uclibc/bin/ld: /nvmedata/autobuild/instance-15/output-1/per-package/ltp-testsuite/host/bin/../mipsel-buildroot-linux-uclibc/sysroot/usr/lib/libc.a(syslog.os): in function `openlog':
syslog.c:(.text+0x6b8): multiple definition of `openlog'; /tmp/ccvRnqfT.o:/nvmedata/autobuild/instance-15/output-1/build/ltp-testsuite-20220121/testcases/kernel/fs/fs-bench/random-access.c:14: first defined here
Fixes:
- http://autobuild.buildroot.org/results/bfd0d906a05564a4f323db604f3b908abf552b20
Signed-off-by: Fabrice Fontaine <fontaine.fabrice@gmail.com>
Reviewed-by: Petr Vorel <petr.vorel@gmail.com>
Signed-off-by: Arnout Vandecappelle (Essensium/Mind) <arnout@mind.be>
(cherry picked from commit e47efc9b90)
Signed-off-by: Peter Korsgaard <peter@korsgaard.com>
Fix the following build failure raised on uclibc and musl since the
addition of libexecinfo package in commit
eea8ba446c:
/home/giuliobenetti/autobuild/run/instance-2/output-1/host/lib/gcc/arm-buildroot-linux-uclibcgnueabi/10.3.0/../../../../arm-buildroot-linux-uclibcgnueabi/bin/ld: /home/giuliobenetti/autobuild/run/instance-2/output-1/host/arm-buildroot-linux-uclibcgnueabi/sysroot/usr/lib/libvcos.so: undefined reference to `backtrace_symbols'
/home/giuliobenetti/autobuild/run/instance-2/output-1/host/lib/gcc/arm-buildroot-linux-uclibcgnueabi/10.3.0/../../../../arm-buildroot-linux-uclibcgnueabi/bin/ld: /home/giuliobenetti/autobuild/run/instance-2/output-1/host/arm-buildroot-linux-uclibcgnueabi/sysroot/usr/lib/libvcos.so: undefined reference to `backtrace'
Fixes:
- http://autobuild.buildroot.org/results/836348270d564a46cc9ee840cf87b2494cc82cec
Signed-off-by: Fabrice Fontaine <fontaine.fabrice@gmail.com>
Signed-off-by: Arnout Vandecappelle (Essensium/Mind) <arnout@mind.be>
(cherry picked from commit c97bc9a2e4)
Signed-off-by: Peter Korsgaard <peter@korsgaard.com>
Drop override system locale patch which is now upstream.
Signed-off-by: James Hilliard <james.hilliard1@gmail.com>
Signed-off-by: Arnout Vandecappelle (Essensium/Mind) <arnout@mind.be>
(cherry picked from commit 9cf8f4e134)
Signed-off-by: Peter Korsgaard <peter@korsgaard.com>
Fix the following build failure with libressl >= 3.4.1 raised since
commit 25ef2c26da:
In file included from eXtl_dtls.c:82:
/home/autobuild/autobuild/instance-4/output-1/host/x86_64-buildroot-linux-musl/sysroot/usr/include/openssl/ssl.h:1272:6: note: previous declaration of 'SSL_set0_rbio' was here
1272 | void SSL_set0_rbio(SSL *s, BIO *rbio);
| ^~~~~~~~~~~~~
eXtl_dtls.c: In function 'SSL_set0_rbio':
eXtl_dtls.c:108:17: error: invalid use of incomplete typedef 'SSL' {aka 'struct ssl_st'}
108 | BIO_free_all(s->rbio);
| ^~
Fixes:
- http://autobuild.buildroot.org/results/dfafdbf71b31fbda1b5ba491ac35239af4a20aa2
Signed-off-by: Fabrice Fontaine <fontaine.fabrice@gmail.com>
Signed-off-by: Arnout Vandecappelle (Essensium/Mind) <arnout@mind.be>
(cherry picked from commit 034928ec5c)
Signed-off-by: Peter Korsgaard <peter@korsgaard.com>
rtl_433 21.12 was discovered to contain a stack overflow in the function
acurite_00275rm_decode at /devices/acurite.c. This vulnerability allows
attackers to cause a Denial of Service (DoS) via a crafted file.
Signed-off-by: Fabrice Fontaine <fontaine.fabrice@gmail.com>
Signed-off-by: Arnout Vandecappelle (Essensium/Mind) <arnout@mind.be>
(cherry picked from commit ba31730843)
Signed-off-by: Peter Korsgaard <peter@korsgaard.com>
Fix the following build failure with libressl >= 2.7.0:
In file included from uams_dhx_passwd.c:35:
openssl_compat.h:15:19: error: static declaration of 'DH_set0_pqg' follows non-static declaration
15 | inline static int DH_set0_pqg(DH *dh, BIGNUM *p, BIGNUM *q, BIGNUM *g)
| ^~~~~~~~~~~
In file included from uams_dhx_passwd.c:33:
/home/autobuild/autobuild/instance-2/output-1/host/mips64-buildroot-linux-uclibc/sysroot/usr/include/openssl/dh.h:195:5: note: previous declaration of 'DH_set0_pqg' was here
195 | int DH_set0_pqg(DH *dh, BIGNUM *p, BIGNUM *q, BIGNUM *g);
| ^~~~~~~~~~~
Fixes:
- http://autobuild.buildroot.org/results/fc6e308f346570f8198542602bc8c1bdd0a4869e
Signed-off-by: Fabrice Fontaine <fontaine.fabrice@gmail.com>
Signed-off-by: Arnout Vandecappelle (Essensium/Mind) <arnout@mind.be>
(cherry picked from commit 2e8218f6aa)
Signed-off-by: Peter Korsgaard <peter@korsgaard.com>
SVG support needs host gcc >= 4.9 since bump of harfbuzz to version
3.1.2 in commit 6861933d22:
In file included from ../src/hb.hh:473:0,
from ../src/hb-buffer-serialize.cc:27:
../src/hb-vector.hh:206:20: error: 'is_trivially_copy_assignable' is not a member of 'std'
hb_enable_if (std::is_trivially_copy_assignable<T>::value)>
^
Fixes:
- http://autobuild.buildroot.org/results/7b2430c5ae4eed51685ec12bf778c07a0a8b1701
Signed-off-by: Fabrice Fontaine <fontaine.fabrice@gmail.com>
Signed-off-by: Arnout Vandecappelle (Essensium/Mind) <arnout@mind.be>
(cherry picked from commit e83eca4496)
Signed-off-by: Peter Korsgaard <peter@korsgaard.com>
Disable duktape with BR2_OPTIMIZE_FAST to fix the following build
failure:
In file included from content/handlers/javascript/duktape/duktape.h:195,
from build/Linux-framebuffer/duktape/application_cache.c:21:
content/handlers/javascript/duktape/duk_config.h:2861:2: error: #error __FAST_MATH__ defined, refusing to compile
2861 | #error __FAST_MATH__ defined, refusing to compile
| ^~~~~
Fixes:
- http://autobuild.buildroot.org/results/2f1b42e2be3aa76cbacd84f3d0ad8b13edce6982
Signed-off-by: Fabrice Fontaine <fontaine.fabrice@gmail.com>
Signed-off-by: Arnout Vandecappelle (Essensium/Mind) <arnout@mind.be>
(cherry picked from commit aa2a017ba9)
Signed-off-by: Peter Korsgaard <peter@korsgaard.com>
Fix the following build failure raised since bump of harfbuzz to version
3.1.2 in commit 6861933d22:
In file included from ../src/hb.hh:473:0,
from ../src/hb-buffer-verify.cc:27:
../src/hb-vector.hh:206:20: error: 'is_trivially_copy_assignable' is not a member of 'std'
hb_enable_if (std::is_trivially_copy_assignable<T>::value)>
^
Fixes:
- http://autobuild.buildroot.org/results/bbc48cb5232c617d4ff1d0bafd63bb3c9c72d556
Signed-off-by: Fabrice Fontaine <fontaine.fabrice@gmail.com>
Signed-off-by: Arnout Vandecappelle (Essensium/Mind) <arnout@mind.be>
(cherry picked from commit 9f0c67179e)
Signed-off-by: Peter Korsgaard <peter@korsgaard.com>
The link to at91.com is outdated and redirects to linux4sam.org
Signed-off-by: Daniel Lang <d.lang@abatec.at>
Signed-off-by: Arnout Vandecappelle (Essensium/Mind) <arnout@mind.be>
(cherry picked from commit 0d6b874d94)
Signed-off-by: Peter Korsgaard <peter@korsgaard.com>
The following build failure is raised since commit
1745fcde74 because
$(HOST_PKG_PYTHON_DISTUTILS_ENV) contains $(HOST_CONFIGURE_OPTS) and so
will override LDFLAGS passed by libselinux.mk:
/usr/bin/gcc -O2 -I/nvmedata/autobuild/instance-11/output-1/host/include -I../include -D_GNU_SOURCE -DNO_ANDROID_BACKEND -L/nvmedata/autobuild/instance-11/output-1/host/lib -Wl,-rpath,/nvmedata/autobuild/instance-11/output-1/host/lib -shared -o libselinux.so.1 avc.lo avc_internal.lo avc_sidtab.lo booleans.lo callbacks.lo canonicalize_context.lo checkAccess.lo check_context.lo checkreqprot.lo compute_av.lo compute_create.lo compute_member.lo compute_relabel.lo compute_user.lo context.lo deny_unknown.lo disable.lo enabled.lo fgetfilecon.lo freecon.lo freeconary.lo fsetfilecon.lo get_context_list.lo get_default_type.lo get_initial_context.lo getenforce.lo getfilecon.lo getpeercon.lo init.lo is_customizable_type.lo label.lo label_db.lo label_file.lo label_media.lo label_support.lo label_x.lo lgetfilecon.lo load_policy.lo lsetfilecon.lo mapping.lo matchmediacon.lo matchpathcon.lo policyvers.lo procattr.lo query_user_context.lo regex.lo reject_unknown.lo selinux_check_securetty_context.l
o selinux_config.lo selinux_restorecon.lo sestatus.lo setenforce.lo setexecfilecon.lo setfilecon.lo setrans_client.lo seusers.lo sha1.lo stringrep.lo validatetrans.lo -ldl -Wl,-soname,libselinux.so.1,--version-script=libselinux.map,-z,defs,-z,relro
/usr/bin/ld: regex.lo: in function `regex_writef':
regex.c:(.text+0x7c): undefined reference to `pcre_fullinfo'
To fix this build failure, instead of moving LDFLAGS after
$(HOST_PKG_PYTHON_DISTUTILS_ENV), drop LDFLAGS and add host-pkgconf
dependency to retrieve pcre dependencies as pkg-config is supported
since version 3.2 and
https://github.com/SELinuxProject/selinux/commit/74093beab0c605641ec413be81e31e6b2f55d8d4
Dropping LDFLAGS will also drop -lpthread which doesn't seem to raise
any build failures with test-pkg:
bootlin-armv5-uclibc [1/6]: OK
bootlin-armv7-glibc [2/6]: OK
bootlin-armv7m-uclibc [3/6]: SKIPPED
bootlin-x86-64-musl [4/6]: OK
br-arm-full-static [5/6]: SKIPPED
sourcery-arm [6/6]: SKIPPED
Apply the same update to the target variant for consistency.
Fixes:
- http://autobuild.buildroot.org/results/d16995f0decef9c9bf58cab4fa30f7daab6918fb
Signed-off-by: Fabrice Fontaine <fontaine.fabrice@gmail.com>
Signed-off-by: Yann E. MORIN <yann.morin.1998@free.fr>
(cherry picked from commit 3bdfb5f5ad)
Signed-off-by: Peter Korsgaard <peter@korsgaard.com>
pamtester uses an archaic configure.in with archaic constructs. This
had generated a configure script that incorrectly tries to look for and
validate a C++ compiler:
checking for powerpc64le-buildroot-linux-gnu-g++... no
checking whether we are using the GNU C++ compiler... no
checking whether no accepts -g... no
checking how to run the C++ preprocessor... /lib/cpp
configure: error: C++ preprocessor "/lib/cpp" fails sanity check
Calling autoreconf fixes the issue, as the generated configure no longer
tries to look for a C++ compiler at all anymore.
Fixes:
- http://autobuild.buildroot.org/results/c000aff659da024b6eef42bca824bdea7b5541c2
Signed-off-by: Fabrice Fontaine <fontaine.fabrice@gmail.com>
[yann.morin.1998@free.fr: expand commit log; add big-fat comment]
Signed-off-by: Yann E. MORIN <yann.morin.1998@free.fr>
(cherry picked from commit 9993a36f5e)
Signed-off-by: Peter Korsgaard <peter@korsgaard.com>
Now that all SuperH cores have an MMU, and must use it, move back the
select BR2_ARCH_HAS_MMU_MANDATORY one level up.
Signed-off-by: Thomas Petazzoni <thomas.petazzoni@bootlin.com>
Signed-off-by: Yann E. MORIN <yann.morin.1998@free.fr>
(cherry picked from commit ec190481a7)
Signed-off-by: Peter Korsgaard <peter@korsgaard.com>
Until commit "arch/Config.in.sh: fixup MMU selection" in this series,
SH2A could either be used with BR2_USE_MMU disabled or BR2_USE_MMU
enabled.
The later made absolutely no sense, since SH2A does not have a MMU:
MMU support was introduced starting from SH3 according to
https://en.wikipedia.org/wiki/SuperH#SH-3
Also, since commit 22d5501e03 ("arch:
tidy up binary formats config"), which was merged in Buildroot
2015.05, the architecture tuple used when BR2_sh2a=y and BR2_USE_MMU
disabled is sh2a-buildroot-uclinux-uclibc, and this was already
unsupported back in the days of Buildroot 2015.08 and binutils 2.24,
causing the build to fail with:
*** BFD does not support target sh2a-buildroot-uclinux-uclibc.
just like it fails to build today with recent version of binutils.
So, this has been broken since 2015.08, and nobody complained. SH2A is
seldom used, so it's time to kill it.
It is worth mentioning that there had been an attempt at resurrecting
SH2 support around 2015 (see https://lwn.net/Articles/647636/) as part
of the J2 core. This effort led to the addition of FDPIC support for
SH2A in the musl C library (and therefore proper ELF binaries, with
shared libraries), but that was never supported in Buildroot. Now that
the J2 project is essentially dead, there is no reason to bother with
this.
Fixes:
http://autobuild.buildroot.net/results/63d01d33ae30f86b63b9f42a9fea116f2f3e9005/
Signed-off-by: Thomas Petazzoni <thomas.petazzoni@bootlin.com>
Signed-off-by: Yann E. MORIN <yann.morin.1998@free.fr>
(cherry picked from commit 04ea3d38dd)
Signed-off-by: Peter Korsgaard <peter@korsgaard.com>
A Buffer Overflow vulnerability exists in zlog 1.2.15 via
zlog_conf_build_with_file in src/zlog/src/conf.c.
Signed-off-by: Fabrice Fontaine <fontaine.fabrice@gmail.com>
Signed-off-by: Arnout Vandecappelle (Essensium/Mind) <arnout@mind.be>
(cherry picked from commit 6eefe2f8f4)
Signed-off-by: Peter Korsgaard <peter@korsgaard.com>
Fix the following build failure with BR2_OPTIMIZE_0 raised since the
addition of the package in commit
efc10eb6b8 and
https://git.netfilter.org/arptables/commit/?id=369afc14de1d89ff5627ff4c5f72f6f839244b50:
libarptc/libarptc.c:48:21: error: redefinition of 'arpt_get_target'
48 | #define GET_TARGET arpt_get_target
| ^~~~~~~~~~~~~~~
libarptc/libarptc_incl.c:16:1: note: in expansion of macro 'GET_TARGET'
16 | GET_TARGET(STRUCT_ENTRY *e)
| ^~~~~~~~~~
In file included from .//include/libarptc/libarptc.h:7,
from libarptc/libarptc.c:26:
.//include/linux/netfilter_arp/arp_tables.h:196:43: note: previous definition of 'arpt_get_target' was here
196 | static __inline__ struct xt_entry_target *arpt_get_target(struct arpt_entry *e)
| ^~~~~~~~~~~~~~~
Fixes:
- http://autobuild.buildroot.org/results/730dce4101e7afcee233067e2870603cd64b8a48
Signed-off-by: Fabrice Fontaine <fontaine.fabrice@gmail.com>
Signed-off-by: Arnout Vandecappelle (Essensium/Mind) <arnout@mind.be>
(cherry picked from commit 3c5ca1fd7e)
Signed-off-by: Peter Korsgaard <peter@korsgaard.com>
Fix the following build failure with BR2_OPTIMIZE_0:
/home/autobuild/autobuild/instance-11/output-1/host/lib/gcc/mips64-buildroot-linux-uclibc/10.3.0/../../../../mips64-buildroot-linux-uclibc/bin/ld: vde_l3.o: in function `ip_output_ready':
vde_l3.c:(.text+0xb30): undefined reference to `iphead'
Fixes:
- http://autobuild.buildroot.org/results/5eeefcdac0b8974a424a885fdc2e82f7cb4b617d
Signed-off-by: Fabrice Fontaine <fontaine.fabrice@gmail.com>
Signed-off-by: Arnout Vandecappelle (Essensium/Mind) <arnout@mind.be>
(cherry picked from commit 68ef4e546d)
Signed-off-by: Peter Korsgaard <peter@korsgaard.com>
Add BR2_PACKAGE_OPENCV4_LIB_DNN to fix the following uclibc build
failure raised since bump to version 4.5.5 in commit
b692231393 and
https://github.com/opencv/opencv/commit/1feb3838b51c0b27b0f3e64f02358ff5ef3111b8:
/home/giuliobenetti/autobuild/run/instance-3/output-1/build/opencv4-4.5.5/modules/dnn/src/layers/elementwise_layers.cpp: In member function 'float cv::dnn::RoundFunctor::calculate(float) const':
/home/giuliobenetti/autobuild/run/instance-3/output-1/build/opencv4-4.5.5/modules/dnn/src/layers/elementwise_layers.cpp:1260:43: error: 'fegetround' is not a member of 'std'
1260 | int old_rounding_direction = std::fegetround();
| ^~~~~~~~~~
/home/peko/autobuild/instance-0/output-1/build/opencv4-4.5.5/modules/dnn/src/layers/elementwise_layers.cpp:1261:14: error: 'fesetround' is not a member of 'std'
1261 | std::fesetround(FE_TONEAREST);
| ^~~~~~~~~~
/home/peko/autobuild/instance-0/output-1/build/opencv4-4.5.5/modules/dnn/src/layers/elementwise_layers.cpp:1261:25: error: 'FE_TONEAREST' was not declared in this scope
1261 | std::fesetround(FE_TONEAREST);
| ^~~~~~~~~~~~
Indeed, uclibc pretends to implement fenv but it raises build failures
on numerous architectures (or1k, sh4, xtensa, mipsel, arm, arc, riscv64,
etc.)
Fixes:
- http://autobuild.buildroot.org/results/a6dd3c10acfbf6bc1af867d770cf0ce926c6ce84
Signed-off-by: Fabrice Fontaine <fontaine.fabrice@gmail.com>
Signed-off-by: Arnout Vandecappelle (Essensium/Mind) <arnout@mind.be>
(cherry picked from commit cc10bd5777)
Signed-off-by: Peter Korsgaard <peter@korsgaard.com>
Add dynamic library dependency to BR2_PACKAGE_WOLFSSL_ALL to fix the
following static build failure with ibrdtnd, a "wolfssl all"-enabled
libcurl and openssl:
/nvmedata/autobuild/instance-5/output-1/per-package/ibrdtnd/host/opt/ext-toolchain/bin/../lib/gcc/sh4aeb-buildroot-linux-musl/11.2.0/../../../../sh4aeb-buildroot-linux-musl/bin/ld: /nvmedata/autobuild/instance-5/output-1/per-package/ibrdtnd/host/bin/../sh4aeb-buildroot-linux-musl/sysroot/usr/lib/libssl.a(ssl_ciph.o): in function `SSL_COMP_get_compression_methods':
ssl_ciph.c:(.text+0x25ac): multiple definition of `SSL_COMP_get_compression_methods'; /nvmedata/autobuild/instance-5/output-1/per-package/ibrdtnd/host/sh4aeb-buildroot-linux-musl/sysroot/usr/lib/libwolfssl.a(libwolfssl_la-ssl.o):ssl.c:(.text+0x1ca60): first defined here
Fixes:
- http://autobuild.buildroot.org/results/be1d327ed4c91a6280a88906a399dfe146f0b64e
Signed-off-by: Fabrice Fontaine <fontaine.fabrice@gmail.com>
Signed-off-by: Arnout Vandecappelle (Essensium/Mind) <arnout@mind.be>
(cherry picked from commit 7d211f6701)
Signed-off-by: Peter Korsgaard <peter@korsgaard.com>
Fixes the following security issues:
- 7zip reader: fix PPMD read beyond boundary (#1671)
- ZIP reader: fix possible out of bounds read (OSS-Fuzz 38766 #1672)
- ISO reader: fix possible heap buffer overflow in read_children() (OSS-Fuzz 38764, #1685)
- RARv4 redaer: fix multiple issues in RARv4 filter code (introduced in libarchive 3.6.0)
- fix heap use after free in archive_read_format_rar_read_data() (OSS-Fuzz 44547, 52efa50)
- fix null dereference in read_data_compressed() (OSS-Fuzz 44843, 1271f77)
- fix heap user after free in run_filters() (OSS-Fuzz 46279, #1715)
Signed-off-by: Francois Perrad <francois.perrad@gadz.org>
Signed-off-by: Arnout Vandecappelle (Essensium/Mind) <arnout@mind.be>
(cherry picked from commit a33130d964)
[Peter: adjust commit message to make it clear that this is a security bump]
Signed-off-by: Peter Korsgaard <peter@korsgaard.com>
Drop host-pkgconf dependency which has been wrongly added by commit
732d94d25f. Indeed, expat doesn't use
pkgconf to retrieve dependencies
Signed-off-by: Fabrice Fontaine <fontaine.fabrice@gmail.com>
Signed-off-by: Arnout Vandecappelle (Essensium/Mind) <arnout@mind.be>
(cherry picked from commit 5bc935665b)
Signed-off-by: Peter Korsgaard <peter@korsgaard.com>
Fix the following build failure on musl:
In file included from /nvmedata/autobuild/instance-17/output-1/host/powerpc64-buildroot-linux-musl/sysroot/usr/include/asm/ioctl.h:12,
from /nvmedata/autobuild/instance-17/output-1/host/powerpc64-buildroot-linux-musl/sysroot/usr/include/linux/ioctl.h:5,
from /nvmedata/autobuild/instance-17/output-1/host/powerpc64-buildroot-linux-musl/sysroot/usr/include/linux/fs.h:14,
from ioctls/vfs.c:3:
ioctls/vfs.c:109:35: error: 'loff_t' undeclared here (not in a function); did you mean 'off_t'?
109 | { .name = "FIOQSIZE", .request = FIOQSIZE, },
| ^~~~~~~~
Fixes:
- http://autobuild.buildroot.org/results/b7f46072751a8d70fa02f1c625c5279f70bec853
Signed-off-by: Fabrice Fontaine <fontaine.fabrice@gmail.com>
Signed-off-by: Arnout Vandecappelle (Essensium/Mind) <arnout@mind.be>
(cherry picked from commit a8614ffc07)
Signed-off-by: Peter Korsgaard <peter@korsgaard.com>
Fix the following build failure with libressl:
CMake Error: TRY_RUN() invoked in cross-compiling mode, please set the following cache variables appropriately:
LIBRESSL_RESULT (advanced)
LIBRESSL_RESULT__TRYRUN_OUTPUT (advanced)
For details see /nvmedata/autobuild/instance-27/output-1/build/mariadb-10.3.34/TryRunResults.cmake
Fixes:
- http://autobuild.buildroot.org/results/cbdbfcdae4b89ac678e1bf6bcded96872c7223ab
Signed-off-by: Fabrice Fontaine <fontaine.fabrice@gmail.com>
Signed-off-by: Arnout Vandecappelle (Essensium/Mind) <arnout@mind.be>
(cherry picked from commit 1748086519)
Signed-off-by: Peter Korsgaard <peter@korsgaard.com>
Fix the following build failure with libressl:
/nvmedata/autobuild/instance-9/output-1/host/lib/gcc/s390x-buildroot-linux-gnu/10.3.0/../../../../s390x-buildroot-linux-gnu/bin/ld: check/libcheck.a(check_ssl.o): in function `ssl_connect':
check_ssl.c:(.text+0x7da): undefined reference to `SSL_set0_wbio'
Fixes:
- http://autobuild.buildroot.org/results/76f72a3c7350ea265e2277c89d68e5256410e94c
Signed-off-by: Fabrice Fontaine <fontaine.fabrice@gmail.com>
Signed-off-by: Arnout Vandecappelle (Essensium/Mind) <arnout@mind.be>
(cherry picked from commit 90bdef4f17)
Signed-off-by: Peter Korsgaard <peter@korsgaard.com>
Fix the following build failure raised since bump to version 1.2 in
commit 242227dd86:
powerpc-buildroot-linux-gnu-gcc: WARNING: unsafe header/library path used in cross-compilation: '-I/usr/include'
In file included from src/aircrack-ng/aircrack-ng.c:54:
/usr/include/math.h:476:21: error: '_Float128' is not supported on this target
476 | # define _Mdouble_ _Float128
| ^~~~~~~~~
Fixes:
- http://autobuild.buildroot.org/results/83a114ce197fb6af53a26ed68184cf3bbb30c8a7
Signed-off-by: Fabrice Fontaine <fontaine.fabrice@gmail.com>
Signed-off-by: Arnout Vandecappelle (Essensium/Mind) <arnout@mind.be>
(cherry picked from commit a8e9b796c9)
Signed-off-by: Peter Korsgaard <peter@korsgaard.com>
Like was done in 700674b45c (package/bind: disable backtrace support)
for the up-to-date, official, upstream bind, also disable backtrace on
dhcp's internal bind to avoid the following build failure since commit
0c8dd6ebd6 (package/dhcp: use internal bind):
/nvmedata/autobuild/instance-15/output-1/host/lib/gcc/armeb-buildroot-linux-uclibcgnueabi/10.3.0/../../../../armeb-buildroot-linux-uclibcgnueabi/bin/ld: /nvmedata/autobuild/instance-15/output-1/build/dhcp-4.4.3/bind/bind-9.11.36/lib/isc/.libs/libisc.so: undefined reference to `_Unwind_GetIP'
Fixes:
- http://autobuild.buildroot.org/results/074786f3f1e7ffc858dcb1de1855ee138793869e
Signed-off-by: Fabrice Fontaine <fontaine.fabrice@gmail.com>
Signed-off-by: Yann E. MORIN <yann.morin.1998@free.fr>
(cherry picked from commit 53efc185bb)
Signed-off-by: Peter Korsgaard <peter@korsgaard.com>
systemd-udevd needs this group:
/usr/lib/udev/rules.d/50-udev-default.rules:43 Unknown group 'sgx', ignoring
Signed-off-by: TIAN Yuanhao <tianyuanhao3@163.com>
[yann.morin.1998@free.fr: udev users/groups go to udev virtual package]
Signed-off-by: Yann E. MORIN <yann.morin.1998@free.fr>
(cherry picked from commit 798a4983ea)
Signed-off-by: Peter Korsgaard <peter@korsgaard.com>
Replace first patch (which is not in master after nearly 4 years) with
a new set of pending patches to fix the following build failure with
gcc >= 7:
liboping.c: In function 'ping_set_ttl':
liboping.c:207:9: error: '%s' directive output may be truncated writing up to 255 bytes into a region of size 242 [-Werror=format-truncation=]
207 | "%s: %s", function, message);
| ^~
......
829 | sstrerror (ret, errbuf, sizeof (errbuf)));
| ~~~~~~~~~~~~~~~~~~~~~~~~~~~~~~~~~~~~~~~~
liboping.c:206:2: note: 'snprintf' output between 15 and 270 bytes into a destination of size 256
206 | snprintf (obj->errmsg, sizeof (obj->errmsg),
| ^~~~~~~~~~~~~~~~~~~~~~~~~~~~~~~~~~~~~~~~~~~~
207 | "%s: %s", function, message);
| ~~~~~~~~~~~~~~~~~~~~~~~~~~~~
Fixes:
- http://autobuild.buildroot.org/results/31083354e9064b2deef86917d67e92a88af0fa46
Signed-off-by: Fabrice Fontaine <fontaine.fabrice@gmail.com>
Signed-off-by: Arnout Vandecappelle (Essensium/Mind) <arnout@mind.be>
(cherry picked from commit 1b47bd987f)
Signed-off-by: Peter Korsgaard <peter@korsgaard.com>
libkrb5 does not build with libressl since commit
b7a5b9d06d and upstream is not interested
in fixing this issue as a PR is opened for more than 4 years
(https://github.com/krb5/krb5/pull/607):
pkinit_crypto_openssl.c: In function 'cms_signeddata_verify':
pkinit_crypto_openssl.c:1700:22: error: implicit declaration of function 'OBJ_get0_data'; did you mean 'BIO_get_data'? [-Werror=implicit-function-declaration]
1700 | print_buffer(OBJ_get0_data(etype), OBJ_length(etype));
| ^~~~~~~~~~~~~
| BIO_get_data
Fixes:
- http://autobuild.buildroot.org/results/e623f4e1d6b6004e98815b8b7da3938238890bd8
Signed-off-by: Fabrice Fontaine <fontaine.fabrice@gmail.com>
Reviewed-by: Petr Vorel <petr.vorel@gmail.com>
Signed-off-by: Arnout Vandecappelle (Essensium/Mind) <arnout@mind.be>
(cherry picked from commit e77c6e9291)
Signed-off-by: Peter Korsgaard <peter@korsgaard.com>
Fixes the following security issues:
CVE-2022-1271: arbitrary-file-write vulnerability
zgrep applied to a crafted file name with two or more newlines
can no longer overwrite an arbitrary, attacker-selected file.
[bug introduced in gzip-1.3.10]
https://www.openwall.com/lists/oss-security/2022/04/07/8
Other changes:
** Changes in behavior
'gzip -l' no longer misreports file lengths 4 GiB and larger.
Previously, 'gzip -l' output the 32-bit value stored in the gzip
header even though that is the uncompressed length modulo 2**32.
Now, 'gzip -l' calculates the uncompressed length by decompressing
the data and counting the resulting bytes. Although this can take
much more time, nowadays the correctness pros seem to outweigh the
performance cons.
'zless' is no longer installed on platforms lacking 'less'.
** Bug fixes
zgrep now names input file on error instead of mislabeling it as
"(standard input)", if grep supports the GNU -H and --label options.
'zdiff -C 5' no longer misbehaves by treating '5' as a file name.
[bug present since the beginning]
Configure-time options like --program-prefix now work.
Release Announcement:
https://lists.gnu.org/r/bug-gzip/2022-04/msg00011.html
Signed-off-by: Marcus Hoffmann <marcus.hoffmann@othermo.de>
Signed-off-by: Arnout Vandecappelle (Essensium/Mind) <arnout@mind.be>
(cherry picked from commit 4bfe7edc4b)
Signed-off-by: Peter Korsgaard <peter@korsgaard.com>
Update out-of-tree driver to make it work with Linux kernel v5.17
(and older kernels not compatible with previous driver version,
like v5.15 etc).
Signed-off-by: Jan Havran <havran.jan@email.cz>
Signed-off-by: Peter Korsgaard <peter@korsgaard.com>
(cherry picked from commit c952070371)
Signed-off-by: Peter Korsgaard <peter@korsgaard.com>
By returning a failure in the event that the initial seed doesn't exist,
we'd then skip creating a new seed, which means we'd never in fact have
an initial seed, and this script is therefore useless. Fix this by
checking for the existence of the seed file first, and just returning 0
if it's not there.
Reported-by: Nicolas Cavallari <Nicolas.Cavallari@green-communications.fr>
Reported-by: Eugen Hristev <Eugen.Hristev@microchip.com>
Signed-off-by: Jason A. Donenfeld <Jason@zx2c4.com>
Signed-off-by: Peter Korsgaard <peter@korsgaard.com>
(cherry picked from commit e65e9acb20)
Signed-off-by: Peter Korsgaard <peter@korsgaard.com>
Fixes the following security issues:
CVE-2022-28346: Potential SQL injection in QuerySet.annotate(), aggregate(), and extra()
QuerySet.annotate(), aggregate(), and extra() methods were subject to SQL
injection in column aliases, using a suitably crafted dictionary, with
dictionary expansion, as the **kwargs passed to these methods.
CVE-2022-28347: Potential SQL injection via QuerySet.explain(**options) on PostgreSQL
QuerySet.explain() method was subject to SQL injection in option names,
using a suitably crafted dictionary, with dictionary expansion, as the
**options argument.
For more details, see the advisory:
https://www.djangoproject.com/weblog/2022/apr/11/security-releases/
Signed-off-by: Peter Korsgaard <peter@korsgaard.com>
(cherry picked from commit 87b8676fbf)
Signed-off-by: Peter Korsgaard <peter@korsgaard.com>
Fixes the following security issues:
16.24.1:
CVE-2021-37706 / AST-2022-004: pjproject: integer underflow on STUN message
The header length on incoming STUN messages that contain an ERROR-CODE
attribute is not properly checked. This can result in an integer underflow.
Note, this requires ICE or WebRTC support to be in use with a malicious
remote party.
https://seclists.org/fulldisclosure/2022/Mar/0
CVE-2022-23608 / AST-2022-005: pjproject: undefined behavior after freeing a
dialog set
When acting as a UAC, and when placing an outgoing call to a target that then
forks Asterisk may experience undefined behavior (crashes, hangs, etc…)
after a dialog set is prematurely freed.
https://seclists.org/fulldisclosure/2022/Mar/1
CVE-2022-21723 / AST-2022-006: pjproject: unconstrained malformed multipart
SIP message
If an incoming SIP message contains a malformed multi-part body an out of
bounds read access may occur, which can result in undefined behavior. Note,
it’s currently uncertain if there is any externally exploitable vector
within Asterisk for this issue, but providing this as a security issue out
of caution.
https://seclists.org/fulldisclosure/2022/Mar/2
16.25.2:
CVE-2022-26498 / AST-2022-001: res_stir_shaken: resource exhaustion with
large files
When using STIR/SHAKEN, it’s possible to download files that are not
certificates. These files could be much larger than what you would expect to
download.
https://seclists.org/fulldisclosure/2022/Apr/17
CVE-2022-26499 / AST-2022-002: res_stir_shaken: SSRF vulnerability with
Identity header
When using STIR/SHAKEN, it’s possible to send arbitrary requests like GET to
interfaces such as localhost using the Identity header.
https://seclists.org/fulldisclosure/2022/Apr/18
CVE-2022-26651 / AST-2022-003: func_odbc: Possible SQL Injection
Some databases can use backslashes to escape certain characters, such as
backticks. If input is provided to func_odbc which includes backslashes it
is possible for func_odbc to construct a broken SQL query and the SQL query
to fail.
https://seclists.org/fulldisclosure/2022/Apr/19
Update hash of sha1.c after a doxygen comment update:
https://github.com/asterisk/asterisk/commit/37c29b6a281d7f69e891117269dbf8c20bacc904
Signed-off-by: Peter Korsgaard <peter@korsgaard.com>
(cherry picked from commit 607162a09c)
Signed-off-by: Peter Korsgaard <peter@korsgaard.com>
Fixes the following security issues:
CVE-2022-1328: mutt_decode_uuencoded() can read past the of the input line
Buffer Overflow in uudecoder in Mutt affecting all versions starting from
0.94.13 before 2.2.3 allows read past end of input line
For details, see the release notes:
https://marc.info/?l=mutt-users&m=164979464612885&w=2
Signed-off-by: Peter Korsgaard <peter@korsgaard.com>
(cherry picked from commit 9b9707d15e)
Signed-off-by: Peter Korsgaard <peter@korsgaard.com>
- Update site to get latest version
- Switch to generic-package and drop patches as upstream doesn't provide
autotools support
- License is MIT since version 1.12.15
- This bump will fix the following build failure with BR2_OPTIMIZE_FAST:
src/sqlite3.c: In function 'sqlite3IsNaN':
src/sqlite3.c:21797:3: error: #error SQLite will not work correctly with the -ffast-math option of GCC.
21797 | # error SQLite will not work correctly with the -ffast-math option of GCC.
| ^~~~~
- This bump will also fix security issues by bumping sqlite to 3.36.0
- Update indentation in hash file (two spaces)
http://sqlitewrapper.kompex-online.com/index.php?content=changelog
Fixes:
- http://autobuild.buildroot.org/results/63e07345b97faa6d6239933f1790c6f2e02da77f
Signed-off-by: Fabrice Fontaine <fontaine.fabrice@gmail.com>
Signed-off-by: Arnout Vandecappelle (Essensium/Mind) <arnout@mind.be>
(cherry picked from commit e2df7d28c2)
Signed-off-by: Peter Korsgaard <peter@korsgaard.com>
Internal bind libraries are not installed to target since commit
0c8dd6ebd6 resulting in the following
runtime failure:
Starting DHCP server: /usr/sbin/dhcpd: error while loading shared libraries: libirs.so.161: cannot open shared object file: No such file or directory
RANLIB must also be set to avoid the following build failure at install
step:
libtool: install: arceb-buildroot-linux-uclibc-ranlib /home/fabrice/buildroot/output/per-package/dhcp/target/usr/lib/libisccfg.a
/home/fabrice/buildroot/output/build/dhcp-4.4.3/bind/bind-9.11.36/libtool: line 1719: arceb-buildroot-linux-uclibc-ranlib: command not found
Fixes:
- No autobuilder failures (reported by Eugen.Hristev@microchip.com)
Signed-off-by: Fabrice Fontaine <fontaine.fabrice@gmail.com>
Signed-off-by: Peter Korsgaard <peter@korsgaard.com>
(cherry picked from commit 2087051d37)
Signed-off-by: Peter Korsgaard <peter@korsgaard.com>
Fixes the following security issues:
- CVE-2021-28544: SVN authz protected copyfrom paths regression
Subversion servers reveal 'copyfrom' paths that should be hidden according
to configured path-based authorization (authz) rules. When a node has
been copied from a protected location, users with access to the copy can
see the `copyfrom' path of the original. This also reveals the fact that
the node was copied. Only the 'copyfrom' path is revealed; not its
contents. Both httpd and svnserve servers are vulnerable.
https://subversion.apache.org/security/CVE-2021-28544-advisory.txt
- CVE-2022-24070: Subversion's mod_dav_svn is vulnerable to memory corruption
While looking up path-based authorization rules, mod_dav_svn servers may
attempt to use memory which has already been freed.
https://subversion.apache.org/security/CVE-2022-24070-advisory.txt
Drop no longer needed patch and autoreconf, as this is now fixed upstream:
https://svn.apache.org/viewvc?view=revision&revision=1881534
Signed-off-by: Peter Korsgaard <peter@korsgaard.com>
(cherry picked from commit 89e51bc625)
Signed-off-by: Peter Korsgaard <peter@korsgaard.com>
Fixes the following security issue:
CVE-2022-24765:
On multi-user machines, Git users might find themselves unexpectedly in
a Git worktree, e.g. when there is a scratch space (`/scratch/`) intended
for all users and another user created a repository in `/scratch/.git`.
Merely having a Git-aware prompt that runs `git status` (or `git diff`)
and navigating to a directory which is supposedly not a Git worktree, or
opening such a directory in an editor or IDE such as VS Code or Atom, will
potentially run commands defined by that other user via
`/scratch/.git/config`.
https://www.openwall.com/lists/oss-security/2022/04/12/7
Signed-off-by: Peter Korsgaard <peter@korsgaard.com>
(cherry picked from commit 832107c6dc)
Signed-off-by: Peter Korsgaard <peter@korsgaard.com>
go1.17.9 (released 2022-04-12) includes security fixes to the
crypto/elliptic and encoding/pem packages, as well as bug fixes to the
linker and runtime.
Signed-off-by: Peter Korsgaard <peter@korsgaard.com>
Reviewed-by: Christian Stewart <christian@paral.in>
Signed-off-by: Peter Korsgaard <peter@korsgaard.com>
(cherry picked from commit 2b2d97780d)
Signed-off-by: Peter Korsgaard <peter@korsgaard.com>
From the release notes:
(https://github.com/redis/redis/blob/6.2.7/00-RELEASENOTES)
Upgrade urgency: SECURITY, contains fixes to security issues.
Security Fixes:
* (CVE-2022-24736) An attacker attempting to load a specially crafted Lua script
can cause NULL pointer dereference which will result with a crash of the
redis-server process. This issue affects all versions of Redis.
[reported by Aviv Yahav].
* (CVE-2022-24735) By exploiting weaknesses in the Lua script execution
environment, an attacker with access to Redis can inject Lua code that will
execute with the (potentially higher) privileges of another Redis user.
[reported by Aviv Yahav].
Signed-off-by: Titouan Christophe <titouanchristophe@gmail.com>
Signed-off-by: Peter Korsgaard <peter@korsgaard.com>
Fixes:
cc1: error: ‘-fcf-protection’ is not compatible with this target
The new Ubuntu GCC packages (e.g. Ubuntu 11.2.0-7ubuntu2, 11.2.0) turn
on ‘-fcf-protection’ globally, which causes a build failure in the x86
realmode code. Turn it off explicitly on compilers that understand this
option.
Signed-off-by: Dario Binacchi <dariobin@libero.it>
Signed-off-by: Dario Binacchi <dario.binacchi@amarulasolutions.com>
Signed-off-by: Arnout Vandecappelle (Essensium/Mind) <arnout@mind.be>
(cherry picked from commit 213629f2d3)
Signed-off-by: Peter Korsgaard <peter@korsgaard.com>
The wireplumber currently as "dbus" in its DEPENDENCIES, but it does
not select/depend on it at the Kconfig level. A simple configuration
such as:
BR2_PACKAGE_LUA=y
BR2_PACKAGE_PIPEWIRE=y
BR2_PACKAGE_WIREPLUMBER=y
Therefore fails to build with:
Makefile:576: *** dbus is in the dependency chain of wireplumber that has added it to its _DEPENDENCIES variable without selecting it or depending on it from Config.in. Stop.
Since dbus is actually an optional dependency of wireplumber, this
commit fixes the issue by really handling it as an optional
dependency.
Fixes: c9a3c10417 ("package/wireplumber: new package")
Signed-off-by: Théo Lebrun <theo.lebrun@bootlin.com>
Signed-off-by: Thomas Petazzoni <thomas.petazzoni@bootlin.com>
(cherry picked from commit 2699eb5631)
Signed-off-by: Peter Korsgaard <peter@korsgaard.com>
Building gen tool of the internal (bundled) bind needs to be for host, not target
Switch to use internal build in commit 0c8dd6ebd6
overlooked this.
Building dns library in /home/autobuild/autobuild/instance-13/output-1/build/dhcp-4.4.2-P1/bind/bind-9.11.14/lib/dns
/bin/sh: line 1: ./gen: cannot execute binary file: Exec format error
Thus, we need to set not just CC, but also CFLAGS etc. otherwise the
target CFLAGS etc. will be inherited from top-level configure.
Fixes:
- http://autobuild.buildroot.org/results/da6fd904d1a6bae73b6ff89dd008de1f459bb7d7/
Signed-off-by: Tim Hammer <Tim.Hammer@orolia.com>
Signed-off-by: Arnout Vandecappelle (Essensium/Mind) <arnout@mind.be>
(cherry picked from commit 7c814fe9b2)
Signed-off-by: Peter Korsgaard <peter@korsgaard.com>
Fix the following build failure without NPTL raised since bump to
version 14.1 in commit c9bd029115 and
https://github.com/postgres/postgres/commit/44bf3d5083e151d772c5d6f656e3e162f573dced:
In file included from pthread_barrier_wait.c:16:
../../src/include/port/pg_pthread.h:31:3: error: conflicting types for 'pthread_barrier_t'
31 | } pthread_barrier_t;
| ^~~~~~~~~~~~~~~~~
In file included from /home/autobuild/autobuild/instance-11/output-1/host/arc-buildroot-linux-uclibc/sysroot/usr/include/bits/uClibc_stdio.h:114,
from /home/autobuild/autobuild/instance-11/output-1/host/arc-buildroot-linux-uclibc/sysroot/usr/include/stdio.h:71,
from ../../src/include/c.h:59,
from pthread_barrier_wait.c:14:
/home/autobuild/autobuild/instance-11/output-1/host/arc-buildroot-linux-uclibc/sysroot/usr/include/bits/pthreadtypes.h:135:3: note: previous declaration of 'pthread_barrier_t' was here
135 | } pthread_barrier_t;
| ^~~~~~~~~~~~~~~~~
Fixes:
- http://autobuild.buildroot.org/results/70acbe121236ef0905c4466d4f7a0839723d2c49
Signed-off-by: Fabrice Fontaine <fontaine.fabrice@gmail.com>
Signed-off-by: Arnout Vandecappelle (Essensium/Mind) <arnout@mind.be>
(cherry picked from commit 6bc3461735)
Signed-off-by: Peter Korsgaard <peter@korsgaard.com>
/nvmedata/autobuild/instance-20/output-1/build/azure-iot-sdk-c-LTS_01_2022_Ref01/c-utility/adapters/tlsio_openssl.c: In function 'add_certificate_to_store':
/nvmedata/autobuild/instance-20/output-1/build/azure-iot-sdk-c-LTS_01_2022_Ref01/c-utility/adapters/tlsio_openssl.c:961:24: error: assignment discards 'const' qualifier from pointer target type [-Werror=discarded-qualifiers]
but SSL_set0_wbio is not provided resulting in the following build
failure:
/nvmedata/autobuild/instance-9/output-1/host/lib/gcc/s390x-buildroot-linux-gnu/10.3.0/../../../../s390x-buildroot-linux-gnu/bin/ld: check/libcheck.a(check_ssl.o): in function `ssl_connect':
check_ssl.c:(.text+0x7da): undefined reference to `SSL_set0_wbio'
Some files were not shown because too many files have changed in this diff
Show More
Reference in New Issue
Block a user
Blocking a user prevents them from interacting with repositories, such as opening or commenting on pull requests or issues. Learn more about blocking a user.