Repeat after me: "Forcing the value of <pkg>_DEPENDENCIES inside a
conditional is the root of all evil."
Repeat after me: "Forcing the value of <pkg>_DEPENDENCIES inside a
conditional is the root of all evil."
Repeat after me: "Forcing the value of <pkg>_DEPENDENCIES inside a
conditional is the root of all evil."
Repeat after me: "Forcing the value of <pkg>_DEPENDENCIES inside a
conditional is the root of all evil."
Enough? :-)
Due to this mistake, any other GDB_DEPENDENCIES defined before this
assignment were lost. For example, the host-flex host-bison added
inside the GDB_FROM_GIT==y condition were ignored if
BR2_PACKAGE_GDB_DEBUGGER.
Fixes the build of all ARC configurations that have
BR2_PACKAGE_GDB_DEBUGGER enabled.
Signed-off-by: Thomas Petazzoni <thomas.petazzoni@bootlin.com>
Signed-off-by: Yann E. MORIN <yann.morin.1998@free.fr>
(cherry picked from commit 97f3ad7af3)
Signed-off-by: Peter Korsgaard <peter@korsgaard.com>
Fixes the following security issue:
- SQUID-2020:12 Out-Of-Bounds memory access in WCCPv2
(CVE-2021-28116 aka ZDI-CAN-11610)
Due to an out of bounds memory access Squid is vulnerable to an
information leak vulnerability when processing WCCPv2 messages.
This problem allows a WCCPv2 sender to corrupt Squids list of
known WCCP routers and divert client traffic to attacker
controlled routers.
This attack is limited to Squid proxy with WCCPv2 enabled and
IP spoofing of a router IP address configured as trusted in
squid.conf.
For more details, see the advisory:
http://lists.squid-cache.org/pipermail/squid-announce/2021-October/000136.html
Signed-off-by: Peter Korsgaard <peter@korsgaard.com>
(cherry picked from commit 6263c1f9a9)
Signed-off-by: Peter Korsgaard <peter@korsgaard.com>
Changelog (since 2021.04.21):
47007d0 wireless-regdb: update regulatory database based on preceding changes
e983a25 Update regulatory rules for Ecuador (EC)
a0bcb88 wireless-regdb: Update regulatory rules for Norway (NO) on 6 and 60 GHz
cdf854d wireless-regdb: Update regulatory rules for Germany (DE) on 6GHz
a4468e8 wireless-regdb: update regulatory database based on preceding changes
86cba52 wireless-regdb: reduce bandwidth for 5730-5850 and 5850-5895 MHz in US
6fa2384 wireless-regdb: remove PTMP-ONLY from 5850-5895 MHz for US
9839e1e wireless-regdb: recent FCC report and order allows 5850-5895 immediately
42dfaf4 wireless-regdb: update 5725-5850 MHz rule for GB
Signed-off-by: Peter Seiderer <ps.report@gmx.net>
Signed-off-by: Peter Korsgaard <peter@korsgaard.com>
(cherry picked from commit 95f3fc514c)
Signed-off-by: Peter Korsgaard <peter@korsgaard.com>
Fix CVE-2021-41617: sshd in OpenSSH 6.2 through 8.x before 8.8, when
certain non-default configurations are used, allows privilege escalation
because supplemental groups are not initialized as expected. Helper
programs for AuthorizedKeysCommand and AuthorizedPrincipalsCommand may
run with privileges associated with group memberships of the sshd
process, if the configuration specifies running the command as a
different user.
https://www.openssh.com/txt/release-8.8https://www.openssh.com/txt/release-8.7
Signed-off-by: Fabrice Fontaine <fontaine.fabrice@gmail.com>
Signed-off-by: Peter Korsgaard <peter@korsgaard.com>
(cherry picked from commit 29b6114acf)
Signed-off-by: Peter Korsgaard <peter@korsgaard.com>
This package uses meson-package infrastracture, so we don't need to
explicitly pass its additional CFLAGS to some variable. The only thing we
need to pass them is to use MESA3D_CFLAGS, because in package/pkg-meson.mk
we have:
$(2)_CFLAGS ?= $$(TARGET_CFLAGS)
that makes the work automatically, where $(2) is exactly the package name,
though $(2)_CFLAGS expands to MESA3D_CFLAGS.
So let's remove the MESA3D_CONF_OPTS += -DCMAKE_C_FLAGS="$(MESA3D_CFLAGS)"
line that has been added by mistake.
Note: this doesn't fix any bug, but remove an unnecessary and ambiguos line
Signed-off-by: Giulio Benetti <giulio.benetti@benettiengineering.com>
Signed-off-by: Peter Korsgaard <peter@korsgaard.com>
(cherry picked from commit 4383fde622)
Signed-off-by: Peter Korsgaard <peter@korsgaard.com>
mesa3d uses very big switch statements, which causes the build to fail
on m68k, beause the offsets there are only 16-bit.
We fix that by using -mlong-jump-table-offsets on m68k, to use 32-bit
offsets for switch statements, but this is only available starting with
gcc 7 [0] [1].
Fixes:
http://autobuild.buildroot.net/results/60c4653c2a93125edbdd0beb43cd47301643464a/
Note: we have two packages that select mesa3d, but:
package/intel-mediadriver/
-> already depends on x86_64, so implies !m68k
package/x11r7/xdriver_xf86-video-imx-viv/
-> imx is an ARM, but xdriver_xf86-video-imx-viv is missing
a depends on BR2_arm (although the comments do have that
dependency). However, it depends on other imx related
packages, and they depend on either arm or aarch64, so
that implies !m68k.
As such, we do not need to propagate that new dependency.
[0] https://gcc.gnu.org/bugzilla/show_bug.cgi?id=57583#c15
[1] https://gcc.gnu.org/bugzilla/show_bug.cgi?id=57583#c16
Signed-off-by: Giulio Benetti <giulio.benetti@benettiengineering.com>
[yann.morin.1998@free.fr:
- add comment
- reword commit log, add BZ references, add non-propagation notes
]
Signed-off-by: Yann E. MORIN <yann.morin.1998@free.fr>
(cherry picked from commit 2fe3a8f81b)
Signed-off-by: Peter Korsgaard <peter@korsgaard.com>
Traditional VT-10x terminals (and their emulators) [0] have a "magic
margins" feature that enables the last character position to be updated
without scrolling the screen: whenever a character is printed on the
last column, the cursor stays over the character, instead of moving to
the next line.
The Busybox shell, ash, attempts to defeat this feature by printing
CR,LF right after echoing a character to the last column.[1] This
doesn't play well with emulator.py. The run() method of the Emulator
class captures the output of the emulated system and assumes the first
line it reads is the echo of the command, and all subsequent lines are
the command's output. If the line made by the command + shell prompt is
longer than 80 characters, then it is echoed as two or more lines, and
all but the first one are mistaken for the command's output.
We fix this by telling the emulated system that we are using an
ultra-wide terminal with 29999 columns. Larger values would be ignored
and replaced by the default, namely 80 columns.[2]
[0] https://vt100.net/docs/vt100-ug/chapter3.html - DECAWM
[1] https://git.busybox.net/busybox/tree/libbb/lineedit.c?h=1_34_0#n412
[2] https://git.busybox.net/busybox/tree/libbb/xfuncs.c?h=1_34_0#n258
Signed-off-by: Edgar Bonet <bonet@grenoble.cnrs.fr>
Reported-by: Thomas Petazzoni <thomas.petazzoni@bootlin.com>
Co-authored-by: Yann E. MORIN <yann.morin.1998@free.fr>
Signed-off-by: Yann E. MORIN <yann.morin.1998@free.fr>
(cherry picked from commit eb3ee3078a)
Signed-off-by: Peter Korsgaard <peter@korsgaard.com>
go1.16.9 (released 2021-10-07) includes a security fix to the linker and
misc/wasm directory, as well as bug fixes to the runtime and to the
text/template package.
Signed-off-by: Christian Stewart <christian@paral.in>
Signed-off-by: Peter Korsgaard <peter@korsgaard.com>
mips_32 is not supported by ffmpeg and it tries to build with loongson3
SIMD support that leads to build failure due to:
/tmp/ccFO2LRa.s: Assembler messages:
/tmp/ccFO2LRa.s:15314: Error: opcode not supported on this processor: mips32 (mips32) `dmult $2,$6'
/tmp/ccFO2LRa.s:15316: Error: opcode not supported on this processor: mips32 (mips32) `dsrl $2,$2,32'
So let's --disable-asm to prevent using those unsupported opcodes for every
mips architecture according to Arnout.
Fixes:
http://autobuild.buildroot.net/results/f01/f01d9cedec8e1b371308d0f7af561a75883fa27c/
Signed-off-by: Giulio Benetti <giulio.benetti@benettiengineering.com>
Signed-off-by: Arnout Vandecappelle (Essensium/Mind) <arnout@mind.be>
(cherry picked from commit 4e822fcadf)
Signed-off-by: Peter Korsgaard <peter@korsgaard.com>
Compiling on Ubuntu 20.04 generates this:
./util.c: In function ‘file_write_dep’
./util.c:54:18: warning: ‘..config.tmp’ directive writing 12 bytes into a region of size between 1 and 4097 [-Wformat-overflow=]
54 | sprintf(buf, "%s..config.tmp", dir);
| ^~~~~~~~~~~~
./util.c:54:2: note: ‘sprintf’ output between 13 and 4109 bytes into a destination of size 4097
54 | sprintf(buf, "%s..config.tmp", dir);
| ^~~~~~~~~~~~~~~~~~~~~~~~~~~~~~~~~~~
and similar warnings on confdata.c, lines 778, 989, 995, 1000, 1007,
1040, 1046 and 1054. Avoid the warnings by enlarging the destination
buffer of fprintf().
Normally, we want changes to kconfig to be reflected by patches in
support/kconfig/patches. This makes it easier to resync with upstream
kconfig. However, in this case, everything that is changed here is
already changed completely (and differently) upstream, so there is no
added value in keeping the patch.
Signed-off-by: Edgar Bonet <bonet@grenoble.cnrs.fr>
Signed-off-by: Arnout Vandecappelle (Essensium/Mind) <arnout@mind.be>
(cherry picked from commit 324612d68e)
Signed-off-by: Peter Korsgaard <peter@korsgaard.com>
When booting under EFI, grub2 will output a nice and shiny boot menu,
using extended ASCII characters (in the [0x80..0xFF] range), namely
CP437 [0], on the assumption that the VGA BIOS is a real one and has the
corresponding (and only!) font, as is the case on real hardware.
However, when run in our runtime test infrastructure, this triggers the
infamous python UnicodeDecodeError exception:
Traceback (most recent call last):
[...]
emulator.login()
File "[...]/buildroot/support/testing/infra/emulator.py", line 89, in login
index = self.qemu.expect(["buildroot login:", pexpect.TIMEOUT],
File "/usr/lib/python3/dist-packages/pexpect/spawnbase.py", line 340, in expect
return self.expect_list(compiled_pattern_list,
File "/usr/lib/python3/dist-packages/pexpect/spawnbase.py", line 369, in expect_list
return exp.expect_loop(timeout)
File "/usr/lib/python3/dist-packages/pexpect/expect.py", line 111, in expect_loop
incoming = spawn.read_nonblocking(spawn.maxread, timeout)
File "/usr/lib/python3/dist-packages/pexpect/pty_spawn.py", line 485, in read_nonblocking
return super(spawn, self).read_nonblocking(size)
File "/usr/lib/python3/dist-packages/pexpect/spawnbase.py", line 178, in read_nonblocking
s = self._decoder.decode(s, final=False)
File "/usr/lib/python3.8/codecs.py", line 322, in decode
(result, consumed) = self._buffer_decode(data, self.errors, final)
UnicodeDecodeError: 'utf-8' codec can't decode byte 0xda in position 0: invalid continuation byte
Grub2 is not wrong in emitting those chars, and basically we should not
expect the packages we test to always emit correct UTF-8 sequences; at
the very least, this should not cause the test infra to fail.
We fix that by telling pexpect.spawn to "fix" such invalid sequences by
replacing them with the suitable Unicode character, U+FFFD REPLACEMENT
CHARACTER.
[0] https://en.wikipedia.org/wiki/Code_page_437
[1] https://docs.python.org/3/library/codecs.html#error-handlers
Signed-off-by: Kory Maincent <kory.maincent@bootlin.com>
[yann.morin.1998@free.fr:
- don't change encoding, use codec_errors
- rewrite commit log accordingly
]
Signed-off-by: Yann E. MORIN <yann.morin.1998@free.fr>
(cherry picked from commit d6d7cbb8e0)
Signed-off-by: Peter Korsgaard <peter@korsgaard.com>
When parsing and adding modules the refpolicy build system checks their
validity using xmllint. By default the host system version is used and
if not found an error is displayed but the build is not stopped. This
leads to interesting issues where modules are not added correctly to
modules.conf[1] (other possible issues are likely).
Fix this by adding a dependency on host-libxml2 and explicitly use the
xmllint binary built by Buildroot.
[1] https://lore.kernel.org/buildroot/20210830114531.2285178-1-jose.pekkarinen@unikie.com/
Tested-by: José Pekkarinen <jose.pekkarinen@unikie.com>
Signed-off-by: Antoine Tenart <atenart@kernel.org>
Signed-off-by: Yann E. MORIN <yann.morin.1998@free.fr>
(cherry picked from commit 5141cee109)
Signed-off-by: Peter Korsgaard <peter@korsgaard.com>
Plus, indent with two spaces in the hash file.
Signed-off-by: Asaf Kahlon <asafka7@gmail.com>
(cherry picked from commit 1c543c729e)
Signed-off-by: Peter Korsgaard <peter@korsgaard.com>
Bugfix release, fixing a number of regressions:
- Fixed a regression in Django 3.2 that caused a crash validating "NaN"
input with a forms.DecimalField when additional constraints, e.g.
max_value, were specified (#32949).
- Fixed a bug in Django 3.2 where a system check would crash on a model with
a reverse many-to-many relation inherited from a parent class (#32947).
- Fixed a regression in Django 3.2 that caused the incorrect offset
extraction from fixed offset timezones (#32992).
https://docs.djangoproject.com/en/3.2/releases/3.2.6/https://docs.djangoproject.com/en/3.2/releases/3.2.7/
Signed-off-by: Peter Korsgaard <peter@korsgaard.com>
Signed-off-by: Arnout Vandecappelle (Essensium/Mind) <arnout@mind.be>
(cherry picked from commit f71e240229)
Signed-off-by: Peter Korsgaard <peter@korsgaard.com>
The various micropython ports may include code licensed under different
licenses compared to the core micropython. List these in MICROPYTHON_LICENSE.
Signed-off-by: Chris Packham <judge.packham@gmail.com>
Signed-off-by: Arnout Vandecappelle (Essensium/Mind) <arnout@mind.be>
(cherry picked from commit 4dc40c21ea)
Signed-off-by: Peter Korsgaard <peter@korsgaard.com>
This release clears CVE-2021-40530 and fixes a problem with ChaCha20
AVX2 implementation. The CVE was due to ElGamal encryption using a work
estimate to size encryption exponents instead subgroup order. The
ChaCha20 issue was due to mishandling a carry in the AVX2 code path. The
ChaCha20 issue was difficult to duplicate, so most users should not
experience it.
https://github.com/weidai11/cryptopp/releases/tag/CRYPTOPP_8_6_0
Signed-off-by: Fabrice Fontaine <fontaine.fabrice@gmail.com>
Signed-off-by: Yann E. MORIN <yann.morin.1998@free.fr>
(cherry picked from commit d714137722)
Signed-off-by: Peter Korsgaard <peter@korsgaard.com>
Syslinux use some python scripts during the build and they
are using python interpreter by default. It fail to build
when there is no python interpreter on the host.
[...]/syslinux-6.03/com32/cmenu/menugen.py
make[6]: python: No such file or directory
Since Syslinux 5.00, we can override the python interpreter
used during the build:
https://repo.or.cz/syslinux.git/commitdiff/4dec62ce9c2c0d170f21b3ae2d7c618eb7a30c05
Add the missing host-python3 dependency and override
it in SYSLINUX_BUILD_CMDS.
Fixes:
https://gitlab.com/kubu93/buildroot/-/jobs/1614446766
Signed-off-by: Romain Naour <romain.naour@gmail.com>
Cc: Arnout Vandecappelle (Essensium/Mind) <arnout@mind.be>
[yann.morin.1998@free.fr: fix check-package]
Signed-off-by: Yann E. MORIN <yann.morin.1998@free.fr>
(cherry picked from commit 6ccfd40711)
Signed-off-by: Peter Korsgaard <peter@korsgaard.com>
Since v2.2 release (commits 8cc36aec912 "doc: De-duplicate readme and
license files" and 9f1622b018ab "doc: Move content out of readme and
create new index page "), the license.rst file at the root of the git
repo is only telling to look at docs/license.rst file.
Let's point the ARM_TRUSTED_FIRMWARE_LICENSE_FILES to the correct file
and modify the .hash file accordingly.
The comment has also been wrong since we bumped from version 1.4 to 2.2
in commit a757d173f1 (boot/arm-trusted-firmware: bump to version
2.2). Drop referencing an explicit version, so that is is never wrong
again.
Signed-off-by: Quentin Schulz <quentin.schulz@theobroma-systems.com>
[yann.morin.1998@free.fr: also fix the comment.]
Signed-off-by: Yann E. MORIN <yann.morin.1998@free.fr>
(cherry picked from commit 8354176915)
[Peter: update hash for v2.4]
Signed-off-by: Peter Korsgaard <peter@korsgaard.com>
In filesystems, variables must be prefixed with ROOTFS_, to avoid
ckashing with packages of the same name.
We do not have a package named 'ext2', so we currently have no clash,
but it is still better that the variables be properly namespaced.
Signed-off-by: Yann E. MORIN <yann.morin.1998@free.fr>
Cc: Kory Maincent <kory.maincent@bootlin.com>
Signed-off-by: Arnout Vandecappelle (Essensium/Mind) <arnout@mind.be>
(cherry picked from commit db7d786140)
Signed-off-by: Peter Korsgaard <peter@korsgaard.com>
Static build with musl fails since bump to version 2020.04 in commit
fe97212976 because LDFLAGS, which contains
-static, is not passed resulting in the following build failure:
/tmp/instance-1/output-1/host/lib/gcc/arm-buildroot-linux-musleabihf/10.3.0/../../../../arm-buildroot-linux-musleabihf/bin/ld: /tmp/instance-1/output-1/host/lib/gcc/arm-buildroot-linux-musleabihf/10.3.0/libgcc.a(_dvmd_lnx.o): in function `__aeabi_ldiv0':
/tmp/instance-1/output-1/build/host-gcc-final-10.3.0/build/arm-buildroot-linux-musleabihf/libgcc/../../../libgcc/config/arm/lib1funcs.S:1499: undefined reference to `raise'
collect2: error: ld returned 1 exit status
Fixes:
- http://autobuild.buildroot.org/results/d71aba27ff0c7711f2cb67261183506f25217a5f
Signed-off-by: Fabrice Fontaine <fontaine.fabrice@gmail.com>
Signed-off-by: Arnout Vandecappelle (Essensium/Mind) <arnout@mind.be>
(cherry picked from commit 84a2723568)
Signed-off-by: Peter Korsgaard <peter@korsgaard.com>
ee8b680816 ("utils/scanpypi: use python3 explicitly") started to use python3,
thus compatibility can be removed:
from __future__ import print_function
from __future__ import absolute_import
Tested with python3 -m py_compile.
Signed-off-by: Petr Vorel <petr.vorel@gmail.com>
Signed-off-by: Arnout Vandecappelle (Essensium/Mind) <arnout@mind.be>
(cherry picked from commit d50290764e)
Signed-off-by: Peter Korsgaard <peter@korsgaard.com>
Fixes the following security issues:
- CVE-2021-22945: UAF and double-free in MQTT sending
When sending data to an MQTT server, libcurl could in some circumstances
erroneously keep a pointer to an already freed memory area and both use
that again in a subsequent call to send data and also free it again.
https://curl.se/docs/CVE-2021-22945.html
- CVE-2021-22946: Protocol downgrade required TLS bypassed
A user can tell curl to require a successful upgrade to TLS when speaking
to an IMAP, POP3 or FTP server (--ssl-reqd on the command line or
CURLOPT_USE_SSL set to CURLUSESSL_CONTROL or CURLUSESSL_ALL with libcurl).
This requirement could be bypassed if the server would return a properly
crafted but perfectly legitimate response.
This flaw would then make curl silently continue its operations without
TLS contrary to the instructions and expectations, exposing possibly
sensitive data in clear text over the network.
https://curl.se/docs/CVE-2021-22946.html
- CVE-2021-22947: STARTTLS protocol injection via MITM
When curl connects to an IMAP, POP3, SMTP or FTP server to exchange data
securely using STARTTLS to upgrade the connection to TLS level, the server
can still respond and send back multiple responses before the TLS upgrade.
Such multiple "pipelined" responses are cached by curl. curl would then
upgrade to TLS but not flush the in-queue of cached responses and instead
use and trust the responses it got before the TLS handshake as if they
were authenticated.
Using this flaw, it allows a Man-In-The-Middle attacker to first inject
the fake responses, then pass-through the TLS traffic from the legitimate
server and trick curl into sending data back to the user thinking the
attacker's injected data comes from the TLS-protected server.
Over POP3 and IMAP an attacker can inject fake response data.
https://curl.se/docs/CVE-2021-22947.html
In addition, 7.79.1 fixes a number of regressions in 7.79.0:
https://daniel.haxx.se/blog/2021/09/22/curl-7-79-1-patched-up-and-ready/
Signed-off-by: Peter Korsgaard <peter@korsgaard.com>
Signed-off-by: Arnout Vandecappelle (Essensium/Mind) <arnout@mind.be>
(cherry picked from commit 6d6842130b)
Signed-off-by: Peter Korsgaard <peter@korsgaard.com>
The file access protection built into Ghostscript proved insufficient for
the "%pipe%" PostScript device, when combined with Ghostscript's requirement
to be able to create and control temporary files in the conventional
temporary file directories (for example, "/tmp" or "/temp). This exploit is
restricted to Unix-like systems (i.e., it doesn't affect Windows). The most
severe claimed results are only feasible if the exploit is run as a "high
privilege" user (root/superuser level) \u2013 a practice we would discourage
under any circumstances.
For more details, see the advisory:
https://ghostscript.com/CVE-2021-3781.html
Signed-off-by: Peter Korsgaard <peter@korsgaard.com>
Signed-off-by: Arnout Vandecappelle (Essensium/Mind) <arnout@mind.be>
(cherry picked from commit 4e415b4164)
Signed-off-by: Peter Korsgaard <peter@korsgaard.com>
Lynx through 2.8.9 mishandles the userinfo subcomponent of a URI, which
allows remote attackers to discover cleartext credentials because they may
appear in SNI data.
https://lists.nongnu.org/archive/html/lynx-dev/2021-08/msg00002.html
Upstream unfortunately does not provide a public VCS (only source
snapshots), so fetch the security patch from Debian.
Signed-off-by: Peter Korsgaard <peter@korsgaard.com>
Signed-off-by: Arnout Vandecappelle (Essensium/Mind) <arnout@mind.be>
(cherry picked from commit 5bb9d79f27)
Signed-off-by: Peter Korsgaard <peter@korsgaard.com>
A gdbinit file passed via '-x' will be read _after_ parsing any
object/core file passed on the command-line. In cross-compilation context,
this is particularly a problem when loading a core file, because without the
'sysroot' specified in the gdbinit file, it will give a lot of warnings,
like:
warning: .dynamic section for "/lib/libstdc++.so.6" is not at the expected address (wrong library or version mismatch?)
warning: .dynamic section for "/lib/librt.so.1" is not at the expected address (wrong library or version mismatch?)
warning: .dynamic section for "/lib/libm.so.6" is not at the expected address (wrong library or version mismatch?)
warning: .dynamic section for "/lib/libgcc_s.so.1" is not at the expected address (wrong library or version mismatch?)
warning: .dynamic section for "/lib/libc.so.6" is not at the expected address (wrong library or version mismatch?)
warning: .dynamic section for "/lib/ld-linux.so.2" is not at the expected address (wrong library or version mismatch?)
warning: .dynamic section for "/lib/libanl.so.1" is not at the expected address (wrong library or version mismatch?)
warning: .dynamic section for "/lib/libdl.so.2" is not at the expected address (wrong library or version mismatch?)
warning: .dynamic section for "/lib/libpthread.so.0" is not at the expected address (wrong library or version mismatch?)
warning: .dynamic section for "/usr/lib/libz.so.1" is not at the expected address (wrong library or version mismatch?)
warning: .dynamic section for "/lib/libnss_files.so.2" is not at the expected address (wrong library or version mismatch?)
warning: Could not load shared library symbols for 17 libraries, e.g. [...]
Use the "info sharedlibrary" command to see the complete listing.
Do you need "set solib-search-path" or "set sysroot"?
In contrast, the '-ix' option will load the specified gdbinit file _before_
parsing object/core files. This will remove said warnings.
See also: https://sourceware.org/bugzilla/show_bug.cgi?id=28330
Signed-off-by: Thomas De Schampheleire <thomas.de_schampheleire@nokia.com>
Signed-off-by: Arnout Vandecappelle (Essensium/Mind) <arnout@mind.be>
(cherry picked from commit e1ee121cae)
Signed-off-by: Peter Korsgaard <peter@korsgaard.com>
To avoid spending some time to build the x86_64 toolchain (~20min),
switch to corei7 cpu (Nahalem) and use the prebuilt Bootlin toolchain.
We have to use the "stable" Bootlin toolchain to use the same kernel version
for the toolchain kernel headers and the running kernel.
With the "bleeding-edge" toolchain we have the "kernel too old" issue
(running kernel 4.19 vs kernel headers 5.4)
Runtime tested locally.
Signed-off-by: Romain Naour <romain.naour@gmail.com>
Cc: Peter Korsgaard <peter@korsgaard.com>
Signed-off-by: Arnout Vandecappelle (Essensium/Mind) <arnout@mind.be>
(cherry picked from commit 521b6f8550)
Signed-off-by: Peter Korsgaard <peter@korsgaard.com>
Switch from the Buildroot internal toolchain for armv5 to
the prebuilt Bootlin external toolchain.
The test doesn't require to build a toolchain, there was
no prebuilt glibc toolchain recent enough at the time this
test has been introduced.
Signed-off-by: Romain Naour <romain.naour@gmail.com>
Signed-off-by: Arnout Vandecappelle (Essensium/Mind) <arnout@mind.be>
(cherry picked from commit 184d20404e)
Signed-off-by: Peter Korsgaard <peter@korsgaard.com>
This test already use builtin kernel provided by the testsuite infra:
self.emulator.boot(arch="armv7",
kernel="builtin",
options=["-initrd", img])
But a second kernel is build from the its defconfig. This second kernel
is not used by the test.
The TestRust (using BR2_PACKAGE_HOST_RUST=y) is really long to build,
save some cpu time by removing the kernel build.
This unused kernel (based on 4.11.3 release) doesn't even build with
host gcc >= 10.
Signed-off-by: Romain Naour <romain.naour@gmail.com>
Signed-off-by: Arnout Vandecappelle (Essensium/Mind) <arnout@mind.be>
(cherry picked from commit f6d438d59f)
Signed-off-by: Peter Korsgaard <peter@korsgaard.com>
The kernel 5.5.7 curently used by the test doesn't build with host
gcc >= 10 due the gcc default -fno-common. See GCC 10 porting guide [1].
/usr/bin/ld: scripts/dtc/dtc-parser.tab.o:(.bss+0x20): multiple definition of `yylloc'; scripts/dtc/dtc-lexer.lex.o:(.bss+0x0): first defined here
But we can't just update this test to the next linux kernel LTS 5.10.y since
the minimum gcc version has been updated to gcc 4.9 since 5.8 kernel [2]
and the Sourcery CodeBench ARM 2014.05 is used (gcc 4.8 based).
Enable arm cortex A9 and VFP support to switch to the ARM arm prebuilt
toolchain (the Bootlin toolchain could be used).
While at it use the prebuilt buildin kernel for the vexpress target
recently updated to 5.10.7.
Fixes:
https://gitlab.com/kubu93/buildroot/-/jobs/1564202094
[1] https://gcc.gnu.org/gcc-10/porting_to.html
[2] https://git.kernel.org/pub/scm/linux/kernel/git/torvalds/linux.git/commit/?id=6ec4476ac82512f09c94aff5972654b70f3772b2
[3] 3cf2782906
Signed-off-by: Romain Naour <romain.naour@gmail.com>
Signed-off-by: Arnout Vandecappelle (Essensium/Mind) <arnout@mind.be>
(cherry picked from commit e0ad7c6411)
Signed-off-by: Peter Korsgaard <peter@korsgaard.com>
The kernel 4.16.7 curently used by the test doesn't build with host
gcc >= 10 due the gcc default -fno-common. See GCC 10 porting guide [1].
/usr/bin/ld: scripts/dtc/dtc-parser.tab.o:(.bss+0x20): multiple definition of `yylloc'; scripts/dtc/dtc-lexer.lex.o:(.bss+0x0): first defined here
Bump to the next LTS release.
[1] https://gcc.gnu.org/gcc-10/porting_to.html
Signed-off-by: Romain Naour <romain.naour@gmail.com>
Signed-off-by: Arnout Vandecappelle (Essensium/Mind) <arnout@mind.be>
(cherry picked from commit 73278c8a70)
Signed-off-by: Peter Korsgaard <peter@korsgaard.com>
The kernel 4.16.7 curently used by the test doesn't build with host
gcc >= 10 due the gcc default -fno-common. See GCC 10 porting guide [1].
/usr/bin/ld: scripts/dtc/dtc-parser.tab.o:(.bss+0x20): multiple definition of `yylloc'; scripts/dtc/dtc-lexer.lex.o:(.bss+0x0): first defined here
Bump to the next LTS release.
[1] https://gcc.gnu.org/gcc-10/porting_to.html
Signed-off-by: Romain Naour <romain.naour@gmail.com>
Signed-off-by: Arnout Vandecappelle (Essensium/Mind) <arnout@mind.be>
(cherry picked from commit e0a64dfc0e)
Signed-off-by: Peter Korsgaard <peter@korsgaard.com>
The kernel 4.11.3 curently used by the test doesn't build with host
gcc >= 10 due the gcc default -fno-common. See GCC 10 porting guide [1].
/usr/bin/ld: scripts/dtc/dtc-parser.tab.o:(.bss+0x20): multiple definition of `yylloc'; scripts/dtc/dtc-lexer.lex.o:(.bss+0x0): first defined here
Bump to the next LTS release.
[1] https://gcc.gnu.org/gcc-10/porting_to.html
Signed-off-by: Romain Naour <romain.naour@gmail.com>
Signed-off-by: Arnout Vandecappelle (Essensium/Mind) <arnout@mind.be>
(cherry picked from commit 69de111c46)
Signed-off-by: Peter Korsgaard <peter@korsgaard.com>
The kernel 4.11.3 curently used by the test doesn't build with host
gcc >= 10 due the gcc default -fno-common. See GCC 10 porting guide [1].
/usr/bin/ld: scripts/dtc/dtc-parser.tab.o:(.bss+0x20): multiple definition of `yylloc'; scripts/dtc/dtc-lexer.lex.o:(.bss+0x0): first defined here
Bump to the next LTS release.
[1] https://gcc.gnu.org/gcc-10/porting_to.html
Signed-off-by: Romain Naour <romain.naour@gmail.com>
Signed-off-by: Arnout Vandecappelle (Essensium/Mind) <arnout@mind.be>
(cherry picked from commit 322b40405e)
Signed-off-by: Peter Korsgaard <peter@korsgaard.com>
Add simple mixer python bindings to build when "Python support for
alsa-lib" is active. smixer-python is the only python module which
exists in alsa-lib. It is compatible with Python2 and Python3.
Signed-off-by: Illia Bitkov <illia.bitkov@mind.be>
Signed-off-by: Arnout Vandecappelle (Essensium/Mind) <arnout@mind.be>
(cherry picked from commit fde3bf94b1)
Signed-off-by: Peter Korsgaard <peter@korsgaard.com>
Added patch fixes linkage of libgc with external libtomic-ops.
Mono uses bundeled bdwgc which doesn't link external libatomic-ops.
Patch is a fix cherry-picked from bdwgc upstream.
Problem found on ARMv5 processors, on newer ARM processors
it uses header based functions and doesn't need built library.
Error:
/home/buildroot/autobuild/instance-3/output-1/host/opt/ext-toolchain/bin/../lib/gcc/arm-buildroot-linux-uclibcgnueabi/9.3.0/../../../../arm-buildroot-linux-uclibcgnueabi/bin/ld: ../../external/bdwgc/.libs/libgc.a(gc.o): in function `GC_steal_mark_stack':
gc.c:(.text+0x2020): undefined reference to `AO_store_full_emulation'
Fixes:
http://autobuild.buildroot.net/results/ebc54e5dea63aca21a4072d294fdede41de559c7http://autobuild.buildroot.net/results/6d10a4bd43fbc9c1d3fa26d5eef394c8023cb85f
Signed-off-by: Illia Bitkov <illia.bitkov@mind.be>
Signed-off-by: Arnout Vandecappelle (Essensium/Mind) <arnout@mind.be>
(cherry picked from commit 7b5a13eb3d)
Signed-off-by: Peter Korsgaard <peter@korsgaard.com>
If the toolchain does not have threads (e.g. br-arm-full-nothread),
compilation fails:
In file included from /home/fail/br-test-pkg/br-arm-full-nothread/build/libressl-3.3.3/crypto/cryptlib.c:117:
/home/fail/br-test-pkg/br-arm-full-nothread/build/libressl-3.3.3/crypto/../include/compat/pthread.h:114:15: fatal error: pthread.h: No such file or directory
114 | #include_next <pthread.h>
| ^~~~~~~~~~~
compilation terminated.
Signed-off-by: Nicolas Cavallari <nicolas.cavallari@green-communications.fr>
Signed-off-by: Arnout Vandecappelle (Essensium/Mind) <arnout@mind.be>
(cherry picked from commit da8f069d74)
Signed-off-by: Peter Korsgaard <peter@korsgaard.com>
The AKA backend for 3GPP2 requires libgmp (see
https://wiki.strongswan.org/projects/strongswan/wiki/Autoconf). Since
the AKA backend for 3GPP2 is included by BR2_PACKAGE_STRONGSWAN_EAP,
when selecting a crypto backend different from
BR2_PACKAGE_STRONGSWAN_GMP, there is no guarantee the gmp package is
selected as well. When doing so, make fails since the package is in the
dependency chain but not selected:
$ make
Makefile:585: *** gmp is in the dependency chain of strongswan that has added it to its _DEPENDENCIES variable without selecting it or depending on it from Config.in. Stop.
make: *** [Makefile:23: _all] Error 2
To fix this, select BR2_PACKAGE_GMP when selecting BR2_PACKAGE_STRONGSWAN_EAP.
Signed-off-by: Martin Elshuber <martin.elshuber@theobroma-systems.com>
Signed-off-by: Yann E. MORIN <yann.morin.1998@free.fr>
(cherry picked from commit 363613a698)
Signed-off-by: Peter Korsgaard <peter@korsgaard.com>
Fixes the following security issues:
- CVE-2021-28902: In function read_yin_container() in libyang <= v1.0.225,
it doesn't check whether the value of retval->ext[r] is NULL. In some
cases, it can be NULL, which leads to the operation of
retval->ext[r]->flags that results in a crash.
- CVE-2021-28903: A stack overflow in libyang <= v1.0.225 can cause a denial
of service through function lyxml_parse_mem(). lyxml_parse_elem()
function will be called recursively, which will consume stack space and
lead to crash.
- CVE-2021-28904: In function ext_get_plugin() in libyang <= v1.0.225, it
doesn't check whether the value of revision is NULL. If revision is NULL,
the operation of strcmp(revision, ext_plugins[u].revision) will lead to a
crash.
- CVE-2021-28905: In function lys_node_free() in libyang <= v1.0.225, it
asserts that the value of node->module can't be NULL. But in some cases,
node->module can be null, which triggers a reachable assertion (CWE-617).
- CVE-2021-28906: In function read_yin_leaf() in libyang <= v1.0.225, it
doesn't check whether the value of retval->ext[r] is NULL. In some cases,
it can be NULL, which leads to the operation of retval->ext[r]->flags that
results in a crash.
Signed-off-by: Peter Korsgaard <peter@korsgaard.com>
Signed-off-by: Yann E. MORIN <yann.morin.1998@free.fr>
(cherry picked from commit 800bf65adc)
Signed-off-by: Peter Korsgaard <peter@korsgaard.com>
CVE-2021-29221 is a Windows specific issue:
A local privilege escalation vulnerability was discovered in Erlang/OTP
prior to version 23.2.3. By adding files to an existing installation's
directory, a local attacker could hijack accounts of other users running
Erlang programs or possibly coerce a service running with "erlsrv.exe" to
execute arbitrary code as Local System. This can occur only under specific
conditions on Windows with unsafe filesystem permissions.
So ignore it.
Signed-off-by: Peter Korsgaard <peter@korsgaard.com>
Signed-off-by: Yann E. MORIN <yann.morin.1998@free.fr>
(cherry picked from commit e7c2eaf929)
Signed-off-by: Peter Korsgaard <peter@korsgaard.com>
Fixes the following security issue:
- CVE-2021-40529: The ElGamal implementation in Botan through 2.18.1, as
used in Thunderbird and other products, allows plaintext recovery because,
during interaction between two cryptographic libraries, a certain
dangerous combination of the prime defined by the receiver's public key,
the generator defined by the receiver's public key, and the sender's
ephemeral exponents can lead to a cross-configuration attack against
OpenPGP
For more details, see the upstream bug and issue writeup:
- https://github.com/randombit/botan/pull/2790
- https://ibm.github.io/system-security-research-updates/2021/07/20/insecurity-elgamal-pt1
Signed-off-by: Peter Korsgaard <peter@korsgaard.com>
Signed-off-by: Yann E. MORIN <yann.morin.1998@free.fr>
(cherry picked from commit 31c94080d2)
Signed-off-by: Peter Korsgaard <peter@korsgaard.com>
Fixes the following security issues:
- CVE-2021-37701: Arbitrary File Creation/Overwrite via insufficient symlink
protection due to directory cache poisoning using symbolic links
- CVE-2021-37712: Arbitrary File Creation/Overwrite via insufficient symlink
protection due to directory cache poisoning using symbolic links
- CVE-2021-37713: Arbitrary File Creation/Overwrite on Windows via
insufficient relative path sanitization
- CVE-2021-39134: UNIX Symbolic Link (Symlink) Following in @npmcli/arborist
- CVE-2021-39135: UNIX Symbolic Link (Symlink) Following in @npmcli/arborist
For more details, see the advisory:
https://nodejs.org/en/blog/vulnerability/aug-2021-security-releases2/
Signed-off-by: Peter Korsgaard <peter@korsgaard.com>
Signed-off-by: Yann E. MORIN <yann.morin.1998@free.fr>
(cherry picked from commit e3bdcdd596)
Signed-off-by: Peter Korsgaard <peter@korsgaard.com>
As the github repository has changed from github.com/AdoptOpenJDK/ to
github.com/adoptium, both versions are updated in the same patch.
Security fixes
JD K-8256157: Improve bytecode assembly
JDK-8256491: Better HTTP transport
JDK-8258432, CVE-2021-2341: Improve file transfers
JDK-8260453: Improve Font Bounding
JDK-8260960: Signs of jarsigner signing
JDK-8260967, CVE-2021-2369: Better jar file validation
JDK-8262380: Enhance XML processing passes
JDK-8262403: Enhanced data transfer
JDK-8262410: Enhanced rules for zones
JDK-8262477: Enhance String Conclusions
JDK-8262967: Improve Zip file support
JDK-8264066, CVE-2021-2388: Enhance compiler validation
JDK-8264079: Improve abstractions
JDK-8264460: Improve NTLM support
Signed-off-by: Adam Duskett <aduskett@gmail.com>
Signed-off-by: Yann E. MORIN <yann.morin.1998@free.fr>
(cherry picked from commit baaf71b9bb)
[Peter: mention security fixes]
Signed-off-by: Peter Korsgaard <peter@korsgaard.com>
The Key Distribution Center (KDC) in MIT Kerberos 5 (aka krb5) before
1.18.5 and 1.19.x before 1.19.3 has a NULL pointer dereference in
kdc/do_tgs_req.c via a FAST inner body that lacks a server field.
Signed-off-by: Fabrice Fontaine <fontaine.fabrice@gmail.com>
Signed-off-by: Yann E. MORIN <yann.morin.1998@free.fr>
(cherry picked from commit b9646b18bf)
Signed-off-by: Peter Korsgaard <peter@korsgaard.com>
Commit 148e695e37 (package/kodi: bump version to 19.0-Matrix) extended
the set of required libraries for various "platform" backends, by
selecting those libraries from the blind options. For example, we have:
config BR2_PACKAGE_KODI_PLATFORM_SUPPORTS_GBM
bool
default y
depends on [...]
select BR2_PACKAGE_LIBINPUT
[...]
However, that option is true as soon as the requirements are met (the
depends on), even when Kodi itself is not enabled.
This means that extra libraries are pulled in to the build, even when
not required.
We fix that by moving the actual selects to the main symbol, along with
the proper conditions. This means that we have two lines that select
libxbcommon, under two different conditions; we could make that a single
select, but the codition would need to be on two lines anyway, so meh...
This is not an ideal solution, because it is a bit ugly, but:
1) adding three new blind options just for the select is kinda extreme
and superfluous;
2) our Kodi packaging is already a bit ugly anyway.
Fixes: #14206
Reported-by: Thomas Ruschival <t.ruschival@gmail.com>
Signed-off-by: Yann E. MORIN <yann.morin.1998@free.fr>
Cc: Bernd Kuhls <bernd.kuhls@t-online.de>
(cherry picked from commit b80c488d04)
Signed-off-by: Peter Korsgaard <peter@korsgaard.com>
&& $THREADS!=none] (ATOMIC_OPS_LIBS): Set to -latomic_ops; do AC_SUBST.
Fix is cherry-picked from bdwgc upstream
Link to original commit https://github.com/ivmai/bdwgc/commit/02a44ee1df8176c72e75fd706d1a8f063d3196d5?branch=02a44ee1df8176c72e75fd706d1a8f063d3196d5&diff=unified
Some files were not shown because too many files have changed in this diff
Show More
Reference in New Issue
Block a user
Blocking a user prevents them from interacting with repositories, such as opening or commenting on pull requests or issues. Learn more about blocking a user.