Fix the following build failure with gcc 4.8 raised since bump to
version 0.6.23 in commit e2f8050976:
exif-gps-ifd.c: In function 'exif_get_gps_tag_info':
exif-gps-ifd.c:62:3: error: 'for' loop initial declarations are only allowed in C99 mode
for (int i = 0; i < sizeof(exif_gps_ifd_tags) / sizeof(ExifGPSIfdTagInfo); ++i) {
^
exif-gps-ifd.c:62:3: note: use option -std=c99 or -std=gnu99 to compile your code
Fixes:
- http://autobuild.buildroot.org/results/7dd222e06d1e6611449fb8fe7516817c9ad43d65
Signed-off-by: Fabrice Fontaine <fontaine.fabrice@gmail.com>
Signed-off-by: Peter Korsgaard <peter@korsgaard.com>
(cherry picked from commit 039de9a291)
Signed-off-by: Peter Korsgaard <peter@korsgaard.com>
Fix CVE-2021-3634: A flaw has been found in libssh in versions prior to
0.9.6. The SSH protocol keeps track of two shared secrets during the
lifetime of the session. One of them is called secret_hash and the other
session_id. Initially, both of them are the same, but after key
re-exchange, previous session_id is kept and used as an input to new
secret_hash. Historically, both of these buffers had shared length
variable, which worked as long as these buffers were same. But the key
re-exchange operation can also change the key exchange method, which can
be based on hash of different size, eventually creating "secret_hash" of
different size than the session_id has. This becomes an issue when the
session_id memory is zeroed or when it is used again during second key
re-exchange.
Signed-off-by: Fabrice Fontaine <fontaine.fabrice@gmail.com>
Signed-off-by: Peter Korsgaard <peter@korsgaard.com>
(cherry picked from commit 88cb451446)
Signed-off-by: Peter Korsgaard <peter@korsgaard.com>
go1.16.7 (released 2021-08-05) includes a security fix to the
net/http/httputil package, as well as bug fixes to the compiler, the
linker, the runtime, the go command, and the net/http package.
https://golang.org/doc/devel/release#go1.16
Signed-off-by: Christian Stewart <christian@paral.in>
Signed-off-by: Peter Korsgaard <peter@korsgaard.com>
(cherry picked from commit 825eec010c)
Signed-off-by: Peter Korsgaard <peter@korsgaard.com>
These minor releases include a security fix according to the new security policy (#44918).
crypto/tls clients can panic when provided a certificate of the wrong type for the negotiated parameters.
net/http clients performing HTTPS requests are also affected. The panic can be triggered by an attacker
in a privileged network position without access to the server certificate's private key, as long as a trusted
ECDSA or Ed25519 certificate for the server exists (or can be issued), or the client is configured with
Config.InsecureSkipVerify. Clients that disable all TLS_RSA cipher suites (that is, TLS 1.0–1.2 cipher
suites without ECDHE), as well as TLS 1.3-only clients, are unaffected.
This is CVE-2021-34558.
View the release notes for more information:
https://golang.org/doc/devel/release.html#go1.16.minor
Signed-off-by: Christian Stewart <christian@paral.in>
Signed-off-by: Thomas Petazzoni <thomas.petazzoni@bootlin.com>
(cherry picked from commit 806b26950d)
Signed-off-by: Peter Korsgaard <peter@korsgaard.com>
Fixes the following security issues:
- CVE-2021-33195: The LookupCNAME, LookupSRV, LookupMX, LookupNS, and
LookupAddr functions in net, and their respective methods on the Resolver
type may return arbitrary values retrieved from DNS which do not follow
the established RFC 1035 rules for domain names. If these names are used
without further sanitization, for instance unsafely included in HTML, they
may allow for injection of unexpected content. Note that LookupTXT may
still return arbitrary values that could require sanitization before
further use
- CVE-2021-33196: The NewReader and OpenReader functions in archive/zip can
cause a panic or an unrecoverable fatal error when reading an archive that
claims to contain a large number of files, regardless of its actual size
- CVE-2021-33197: ReverseProxy in net/http/httputil could be made to forward
certain hop-by-hop headers, including Connection. In case the target of
the ReverseProxy was itself a reverse proxy, this would let an attacker
drop arbitrary headers, including those set by the ReverseProxy.Director
- CVE-2021-33198: The SetString and UnmarshalText methods of math/big.Rat
may cause a panic or an unrecoverable fatal error if passed inputs with
very large exponents
Signed-off-by: Peter Korsgaard <peter@korsgaard.com>
(cherry picked from commit 0c60007419)
Signed-off-by: Peter Korsgaard <peter@korsgaard.com>
Fixes the following security issues:
- CVE-2021-31525: ReadRequest and ReadResponse in net/http can hit an
unrecoverable panic when reading a very large header (over 7MB on 64-bit
architectures, or over 4MB on 32-bit ones). Transport and Client are
vulnerable and the program can be made to crash by a malicious server.
Server is not vulnerable by default, but can be if the default max header
of 1MB is overridden by setting Server.MaxHeaderBytes to a higher value,
in which case the program can be made to crash by a malicious client.
https://github.com/golang/go/issues/45710
Signed-off-by: Peter Korsgaard <peter@korsgaard.com>
(cherry picked from commit 1cfc01a008)
Signed-off-by: Peter Korsgaard <peter@korsgaard.com>
go1.16.1 (released 2021/03/10) includes security fixes to the archive/zip and
encoding/xml packages.
go1.16.2 (released 2021/03/11) includes fixes to cgo, the compiler, linker, the
go command, and the syscall and time packages.
https://golang.org/doc/devel/release.html#go1.16
Signed-off-by: Christian Stewart <christian@paral.in>
Signed-off-by: Yann E. MORIN <yann.morin.1998@free.fr>
(cherry picked from commit 9b36b4aa28)
Signed-off-by: Peter Korsgaard <peter@korsgaard.com>
Release notes: https://golang.org/doc/go1.16
The latest Go release, version 1.16, arrives six months after Go 1.15. Most of
its changes are in the implementation of the toolchain, runtime, and libraries.
The linker changes in 1.16 extend the 1.15 improvements to all supported
architecture/OS combinations (the 1.15 performance improvements were primarily
focused on ELF-based OSes and amd64 architectures). For a representative set of
large Go programs, linking is 20-25% faster than 1.15 and requires 5-15% less
memory on average for linux/amd64, with larger improvements for other
architectures and OSes. Most binaries are also smaller as a result of more
aggressive symbol pruning.
According to the release notes, Go 1.16 drops support for x87 mode
compilation (GO386=387). Support for non-SSE2 processors is now available
using soft float mode. Buildroot will automatically set GO386=softfloat on
non-SSE2 processors.
Signed-off-by: Christian Stewart <christian@paral.in>
v1 -> v2:
- added 386=softfloat handling re: Peter's review
Signed-off-by: Christian Stewart <christian@paral.in>
Signed-off-by: Peter Korsgaard <peter@korsgaard.com>
(cherry picked from commit 9c035502bf)
Signed-off-by: Peter Korsgaard <peter@korsgaard.com>
protobuf moved from the google org to protocolbuffers in 2018.
There is a redirect but we should use the official url.
Signed-off-by: Michael Nosthoff <buildroot@heine.tech>
Signed-off-by: Yann E. MORIN <yann.morin.1998@free.fr>
(cherry picked from commit 107103ef91)
Signed-off-by: Peter Korsgaard <peter@korsgaard.com>
Force relative file path resolution of DEVELOPERS file entries to use
forward-slash separators since pattern matching assumes forward slashes.
This is to help permit uses invoking `get-developers` on Platforms where
`os.sep` may not be a forward slash.
Signed-off-by: James Knight <james.d.knight@live.com>
Signed-off-by: Arnout Vandecappelle (Essensium/Mind) <arnout@mind.be>
(cherry picked from commit eb75d71b80)
Signed-off-by: Peter Korsgaard <peter@korsgaard.com>
Fix MKIMAGE_ARCH handling to avoid the following build failure:
/home/buildroot/autobuild/instance-0/output-1/build/host-uboot-tools-2021.07/tools/mkimage -C none -A openrisc -T script -d /home/buildroot/autobuild/instance-0/output-1/boot_script.txt /home/buildroot/autobuild/instance-0/output-1/build/host-uboot-tools-2021.07/tools/boot.scr
Invalid architecture, supported are:
alpha Alpha
arc ARC
arm ARM
arm64 AArch64
avr32 AVR32
blackfin Blackfin
ia64 IA64
invalid Invalid ARCH
m68k M68K
microblaze MicroBlaze
mips MIPS
mips64 MIPS 64 Bit
nds32 NDS32
nios2 NIOS II
or1k OpenRISC 1000
powerpc PowerPC
riscv RISC-V
s390 IBM S390
sandbox Sandbox
sh SuperH
sparc SPARC
sparc64 SPARC 64 Bit
x86 Intel x86
x86_64 AMD x86_64
xtensa Xtensa
Strangely enough, we only have autobuilder failures since July 2021 even
as or1k has been used since the addition of openriscv support in 2012:
https://github.com/u-boot/u-boot/commit/3ddcaccda3824e1c7f7266d543e4c0eb3ea9851c
For x86_64, we incorrectly mangle it to x86.
Finally, the comment about mips64 is wrong: mips64 *is* a valid
archtecture, and we anyway had no code to tweak that case.
Fixes:
- http://autobuild.buildroot.org/results/c3f0f2a3fb87d74bfdaccf9b94c66f0b5bae7520
Signed-off-by: Fabrice Fontaine <fontaine.fabrice@gmail.com>
[yann.morin.1998@free.fr: extend commit log for mips64 and x86_64]
Signed-off-by: Yann E. MORIN <yann.morin.1998@free.fr>
(cherry picked from commit 5e8804d4e4)
Signed-off-by: Peter Korsgaard <peter@korsgaard.com>
Fix the following static build failure on musl which is raised because
the "Check for directory libraries" in configure wrongly adds -DNO_DIR
when no directory library is needed:
/tmp/instance-0/output-1/host/bin/arm-buildroot-linux-musleabihf-gcc -c -D_FILE_OFFSET_BITS=64 -O2 -g0 -static -I. -DUNIX -DUIDGID_NOT_16BIT -DBZIP2_SUPPORT -DLARGE_FILE_SUPPORT -DUNICODE_SUPPORT -DNO_MKTIME -DNO_DIR -DHAVE_DIRENT_H -DHAVE_TERMIOS_H unix/unix.c
unix/unix.c:70:14: error: conflicting types for 'DIR'
70 | typedef FILE DIR;
| ^~~
Fixes:
- http://autobuild.buildroot.org/results/83a6e0c8c4ad026cb0261246e3b1a80d754454bd
Patch not sent upstream since upstream is dead.
Signed-off-by: Fabrice Fontaine <fontaine.fabrice@gmail.com>
Signed-off-by: Arnout Vandecappelle (Essensium/Mind) <arnout@mind.be>
(cherry picked from commit ea0a4c610d)
Signed-off-by: Peter Korsgaard <peter@korsgaard.com>
environment-setup uses BASH_SOURCE which is bash specific. For other
shells, this variable is empty, leading to an error message and empty
SDK_PATH.
Zsh Uses $0. Unfortunately POSIX is not specifying how exactly $0
should behave when in sourced (or using special dot utility). So other
shell support have to be implemented in different manner.
Signed-off-by: Krzysztof Kanas <kkanas@fastmail.com>
Signed-off-by: Arnout Vandecappelle (Essensium/Mind) <arnout@mind.be>
(cherry picked from commit 65cee90cc3)
Signed-off-by: Peter Korsgaard <peter@korsgaard.com>
Since the website depends on the webserver being enabled we should
add a config option for it and make the website depend on that.
We should also ensure that the mongoose(webserver) config is present.
Signed-off-by: James Hilliard <james.hilliard1@gmail.com>
Signed-off-by: Arnout Vandecappelle (Essensium/Mind) <arnout@mind.be>
(cherry picked from commit 25b0645aa4)
Signed-off-by: Peter Korsgaard <peter@korsgaard.com>
This needs to be set properly so that services work correctly.
Enable disable automatically based on BR2_PACKAGE_SYSTEMD state.
Signed-off-by: James Hilliard <james.hilliard1@gmail.com>
Signed-off-by: Arnout Vandecappelle (Essensium/Mind) <arnout@mind.be>
(cherry picked from commit 85062dcefc)
Signed-off-by: Peter Korsgaard <peter@korsgaard.com>
This ensures all tools/libraries will be properly installed.
Update SWUPDATE_BUILD_CMDS param ordering for consistency.
Signed-off-by: James Hilliard <james.hilliard1@gmail.com>
Signed-off-by: Arnout Vandecappelle (Essensium/Mind) <arnout@mind.be>
(cherry picked from commit 08de8f500e)
Signed-off-by: Peter Korsgaard <peter@korsgaard.com>
The swupdate services do not depend on
BR2_PACKAGE_SWUPDATE_INSTALL_WEBSITE, so install them unconditionally.
Signed-off-by: James Hilliard <james.hilliard1@gmail.com>
Signed-off-by: Arnout Vandecappelle (Essensium/Mind) <arnout@mind.be>
(cherry picked from commit cbeaef0f95)
Signed-off-by: Peter Korsgaard <peter@korsgaard.com>
In buildroot, stripping for the target is configured and implemented
with the global `BR2_STRIP_strip` option that drive the stripping in
the target-finalize step.
So, we explicitly disable stripping at build time for swupdate.
Signed-off-by: James Hilliard <james.hilliard1@gmail.com>
Signed-off-by: Arnout Vandecappelle (Essensium/Mind) <arnout@mind.be>
(cherry picked from commit 1833c710ce)
Signed-off-by: Peter Korsgaard <peter@korsgaard.com>
sox also provides one or more libraries with headers, so also install
sox to staging.
Signed-off-by: Adrian Amaglio <nainformatique@gresille.org>
[Giulio: reword commit log]
Signed-off-by: Giulio Benetti <giulio.benetti@benettiengineering.com>
[yann.morin.1998@free.fr:
- further refine commit log
- move assignment in a more sensible location
]
Signed-off-by: Yann E. MORIN <yann.morin.1998@free.fr>
(cherry picked from commit b6ff11fd9d)
Signed-off-by: Peter Korsgaard <peter@korsgaard.com>
Fixes the following security issues:
- CVE-2021-40346: An integer overflow exists in HAProxy 2.0 through 2.5 in
the htx_add_header() can be exploited to perform an HTTP request smuggling
attack, allowing an attacker to bypass all configured http-request HAProxy
ACLs and possibly other ACLs.
For more details, see the advisory:
https://www.mail-archive.com/haproxy@formilux.org/msg41114.html
Signed-off-by: Peter Korsgaard <peter@korsgaard.com>
Explicitly indicate the file encoding to UTF-8 for the DEVELOPERS
document. This prevents Unicode decoding errors when printing E-Mail
entries with Unicode characters on systems using an alternative default
encoding (e.g. 'CP1252').
This corrects the following observed error:
$ ./utils/get-developers outgoing/*
Traceback (most recent call last):
File "utils\get-developers", line 105, in <module>
__main__()
File "utils\get-developers", line 47, in __main__
devs = getdeveloperlib.parse_developers()
File "...\buildroot\utils\getdeveloperlib.py", line 239, in parse_developers
for line in f:
File "...\Python<ver>\lib\encodings\cp1252.py", line 23, in decode
return codecs.charmap_decode(input,self.errors,decoding_table)[0]
UnicodeDecodeError: 'charmap' codec can't decode byte 0x81 in position 6659: character maps to <undefined>
Signed-off-by: James Knight <james.d.knight@live.com>
Signed-off-by: Thomas Petazzoni <thomas.petazzoni@bootlin.com>
(cherry picked from commit 9f127cc420)
Signed-off-by: Peter Korsgaard <peter@korsgaard.com>
Fix the following uclibc build failure raised since at least bump to
version 0.11.0 in commit 0bc9c89612:
In file included from ../include/wlr/types/wlr_data_device.h:13,
from ../types/data_device/wlr_drag.c:7:
../include/wlr/types/wlr_seat.h:221:18: error: field 'last_event' has incomplete type
221 | struct timespec last_event;
| ^~~~~~~~~~
Fixes:
- http://autobuild.buildroot.org/results/3501ceb4290638b2f6d70aaa4d8ce74feec3a525
Signed-off-by: Fabrice Fontaine <fontaine.fabrice@gmail.com>
(cherry picked from commit 301502b7f7)
Signed-off-by: Peter Korsgaard <peter@korsgaard.com>
Fix the following build failure on riscv32:
In file included from thread/qmutex_linux.cpp:45,
from thread/qmutex.cpp:804:
thread/qfutex_p.h: In function 'int QtLinuxFutex::_q_futex(int*, int, int, quintptr, int*, int)':
thread/qfutex_p.h:116:30: error: '__NR_futex' was not declared in this scope; did you mean '_q_futex'?
116 | int result = syscall(__NR_futex, addr, op | FUTEX_PRIVATE_FLAG, val, val2, addr2, val3);
| ^~~~~~~~~~
| _q_futex
Fixes:
- http://autobuild.buildroot.org/results/ffedfc000029072d5d724e98ab4551fe973658ce
Signed-off-by: Fabrice Fontaine <fontaine.fabrice@gmail.com>
(cherry picked from commit 050be3ad35)
Signed-off-by: Peter Korsgaard <peter@korsgaard.com>
The configure script fails to detect libpcap in static build because it
does not take into account the libnl dependency on link. As a result the
configure script silently disables mausezahn build even when
BR2_PACKAGE_NETSNIFF_NG_MAUSEZAHN is enabled. Add upstream patch to use
pkg-config for libpcap link flags.
Cc: Joris Lijssens <joris.lijssens@gmail.com>
Signed-off-by: Baruch Siach <baruch@tkos.co.il>
Signed-off-by: Peter Korsgaard <peter@korsgaard.com>
(cherry picked from commit de39a17f71)
Signed-off-by: Peter Korsgaard <peter@korsgaard.com>
Fixes the following security issues:
- bpo-42278: Replaced usage of tempfile.mktemp() with TemporaryDirectory to
avoid a potential race condition.
- bpo-41180: Add auditing events to the marshal module, and stop raising
code.__init__ events for every unmarshalled code object. Directly
instantiated code objects will continue to raise an event, and audit event
handlers should inspect or collect the raw marshal data. This reduces a
significant performance overhead when loading from .pyc files.
- bpo-44394: Update the vendored copy of libexpat to 2.4.1 (from 2.2.8) to
get the fix for the CVE-2013-0340 “Billion Laughs” vulnerability. This
copy is most used on Windows and macOS.
- bpo-43124: Made the internal putcmd function in smtplib sanitize input for
presence of \r and \n characters to avoid (unlikely) command injection.
https://www.python.org/downloads/release/python-397/
Signed-off-by: Peter Korsgaard <peter@korsgaard.com>
(cherry picked from commit c8bf903e7a)
Signed-off-by: Peter Korsgaard <peter@korsgaard.com>
Though several cross-compilation patches exist in buildroot's nginx
package dir they do not seem to address endianness.
The test program generated by the configure script compiles but fails
to run (as it is built for another architecture) but the script does
not distinguish between the failure to run the program and an
indication of certain endianness. As such the fallback of big-endian
is used. This setting then causes http2 headers (anything not in the
static dictionary) to come out as undecipherable trash on 64bit
targets (see ngx_http_v2_huff_encode_buf()).
This commit includes a patch to the configure script to allow a
`--force-endianness=big|little` flag as well as setting that flag in
buildroot's package makefile.
Signed-off-by: Nevo Hed <nhed+buildroot@starry.com>
Signed-off-by: Yann E. MORIN <yann.morin.1998@free.fr>
(cherry picked from commit e205b5ec18)
Signed-off-by: Peter Korsgaard <peter@korsgaard.com>
- NodeJS passes NULL for addr and 0 for addrlen to
ares_parse_ptr_reply() on systems where malloc(0) returns NULL. This
would cause a crash.
- If ares_getaddrinfo() was terminated by an ares_destroy(), it would
cause a crash
- Crash in sortaddrinfo() if the list size equals 0 due to an unexpected
DNS response
- Expand number of escaped characters in DNS replies as per RFC1035 5.1
to prevent spoofing follow-up
- Perform validation on hostnames to prevent possible XSS due to
applications not performing valiation themselves
https://c-ares.haxx.se/changelog.html#1_17_2
Signed-off-by: Fabrice Fontaine <fontaine.fabrice@gmail.com>
Signed-off-by: Yann E. MORIN <yann.morin.1998@free.fr>
(cherry picked from commit 6be5219c41)
Signed-off-by: Peter Korsgaard <peter@korsgaard.com>
Since commit 39d334faa5 (package/pkg-qmake: add <pkg>_SYNC_QT_HEADERS
support), the qmake-package infra recognises said variable but the
manual has the wrong variable name, which is missing the "_QT" part.
We fix that by amending the manual to document the proper variable name.
Signed-off-by: Yann E. MORIN <yann.morin.1998@free.fr>
(cherry picked from commit ac2db5eb2e)
Signed-off-by: Peter Korsgaard <peter@korsgaard.com>
Fix build of xen with 64 bits time_t:
/tmp/instance-0/output-1/build/xen-4.14.2/tools/qemu-xen/hw/input/virtio-input-host.c: In function 'virtio_input_host_handle_status':
/tmp/instance-0/output-1/build/xen-4.14.2/tools/qemu-xen/hw/input/virtio-input-host.c:198:28: error: 'struct input_event' has no member named 'time'
198 | if (gettimeofday(&evdev.time, NULL)) {
| ^
Fixes:
- http://autobuild.buildroot.org/results/136ce42f44bf48d3db4eda7b1548bf7ac1b97d51
Signed-off-by: Fabrice Fontaine <fontaine.fabrice@gmail.com>
Signed-off-by: Arnout Vandecappelle (Essensium/Mind) <arnout@mind.be>
(cherry picked from commit 7ba9967287)
Signed-off-by: Peter Korsgaard <peter@korsgaard.com>
This version bump is needed to pass the ATF test with
hardening option enabled (-fstack-protector-strong)
With the version v2.2, ATF fail due to undefined references:
./build/juno/release/bl2u/arm_tzc400.o: In function `arm_tzc400_setup':
arm_tzc400.c:(.text.arm_tzc400_setup+0x10): undefined reference to `__stack_chk_guard'
arm_tzc400.c:(.text.arm_tzc400_setup+0x18): undefined reference to `__stack_chk_guard'
arm_tzc400.c:(.text.arm_tzc400_setup+0xb8): undefined reference to `__stack_chk_guard'
arm_tzc400.c:(.text.arm_tzc400_setup+0xcc): undefined reference to `__stack_chk_fail'
Since commit ccac9a5bbb, Buildroot no
longer forces ENABLE_STACK_PROTECTOR. However, we rely on the ATF build
system to handle it correctly, and this wasn't the case in v2.2.
Fixes: https://gitlab.com/buildroot.org/buildroot/-/jobs/1524842591
Signed-off-by: Romain Naour <romain.naour@gmail.com>
Signed-off-by: Arnout Vandecappelle (Essensium/Mind) <arnout@mind.be>
(cherry picked from commit e5494f1fac)
Signed-off-by: Peter Korsgaard <peter@korsgaard.com>
When BR2_REPRODUCIBLE is set and host-coreutils needs to be built, the
fakedate script installed to 'host/bin/date' will be overwritten by
host-coreutils.
Besides, we do not need our host-coreutils for 'date' at all; we really
rely on the host system to provide it.
Unconditionally disable installing the 'date' binary in host-coreutils.
Note that we explicitly request only ln and realpath to be installed,
but the coreutils buildsystem does not strictly obey to that, as was
already noticed in 885e6fdb8a (package/coreutils: introduce a host
variant), which added that comment above HOST_COREUTILS_CONF_OPTS:
# Explicitly install ln and realpath, which we *are* insterested in.
# A lot of other programs still get installed, however, but disabling
# them does not gain much at build time, and is a loooong list that is
# difficult to maintain...
So, we also update that comment to explain why we still anyway disable
installation of 'date'.
Signed-off-by: Conrad Ratschan <conrad.ratschan@collins.com>
[yann.morin.1998@free.fr:
- unconditionally disable installing date
- extend comment and commit log to explain why we need
--enable-no-install-program=date despite the existing
--enable-install-program=ln,realpath
]
Signed-off-by: Yann E. MORIN <yann.morin.1998@free.fr>
(cherry picked from commit bdf7929109)
Signed-off-by: Peter Korsgaard <peter@korsgaard.com>
Previously, alsa-plugins would not work if alsa-utils was installed
after it. This happened because:
1. alsa-plugins copies some files $(TARGET_DIR)/usr/share/alsa/alsa.conf.d
2. alsa-utils removes these files during installation ( rm -rf $(TARGET_DIR)/usr/share/alsa/;)
The `rm -rf` command was originally added as part of the fix for
https://bugs.buildroot.org/show_bug.cgi?id=1573 11 years ago.
The intention might have been to allow for unconfiguring some options
and then rebuilding alsa-utils. However, this is a scenario that does
not work anyway.
The simplest fix for the `alsa-plugins` compatibility issue appears to
be to remove the `rm -rf` command.
Signed-off-by: Gleb Mazovetskiy <glex.spb@gmail.com>
Signed-off-by: Arnout Vandecappelle (Essensium/Mind) <arnout@mind.be>
(cherry picked from commit 3454bc9924)
Signed-off-by: Peter Korsgaard <peter@korsgaard.com>
Maxime has not been contributing to Buildroot for several years, so it
doesn't make sense to keep him in the DEVELOPERS file and make us
think that those packages are being maintained and to Cc: him on
patches affecting those packages.
Signed-off-by: Thomas Petazzoni <thomas.petazzoni@bootlin.com>
Signed-off-by: Arnout Vandecappelle (Essensium/Mind) <arnout@mind.be>
(cherry picked from commit a29124febf)
Signed-off-by: Peter Korsgaard <peter@korsgaard.com>
gcc 10.x is now used by default but the kernel 4.19 used by
test_docker_compose doesn't build with it.
Bump the kernel to 4.19.204 release that contains a lot of
fixes for newer gcc.
Signed-off-by: Romain Naour <romain.naour@gmail.com>
Signed-off-by: Thomas Petazzoni <thomas.petazzoni@bootlin.com>
(cherry picked from commit 5d60e07e27)
Signed-off-by: Peter Korsgaard <peter@korsgaard.com>
Fix the following build failure on riscv32:
../src/util/futex.h: In function 'sys_futex':
../src/util/futex.h:39:19: error: 'SYS_futex' undeclared (first use in this function); did you mean 'sys_futex'?
39 | return syscall(SYS_futex, addr1, op, val1, timeout, addr2, val3);
| ^~~~~~~~~
| sys_futex
Fixes:
- http://autobuild.buildroot.org/results/692700a5f967760a0b8cd358b1712f1d5a7b681e
Signed-off-by: Fabrice Fontaine <fontaine.fabrice@gmail.com>
Signed-off-by: Arnout Vandecappelle (Essensium/Mind) <arnout@mind.be>
(cherry picked from commit 3298e67ac6)
Signed-off-by: Peter Korsgaard <peter@korsgaard.com>
GNU cpio through 2.13 allows attackers to execute arbitrary code via a
crafted pattern file, because of a dstring.c ds_fgetstr integer overflow
that triggers an out-of-bounds heap write. NOTE: it is unclear whether
there are common cases where the pattern file, associated with the -E
option, is untrusted data.
Signed-off-by: Fabrice Fontaine <fontaine.fabrice@gmail.com>
Signed-off-by: Yann E. MORIN <yann.morin.1998@free.fr>
(cherry picked from commit 89857df2d1)
Signed-off-by: Peter Korsgaard <peter@korsgaard.com>
This reverts commit 46b8fb7500 indeed if
libressl is selected as the openssl provider, the BR2_PACKAGE_OPENSSL
conditition will always be used and the BR2_PACKAGE_LIBRESSL condition
will never be triggered. Moreover, libressl provides a pkg-config file.
Signed-off-by: Fabrice Fontaine <fontaine.fabrice@gmail.com>
Signed-off-by: Thomas Petazzoni <thomas.petazzoni@bootlin.com>
(cherry picked from commit da4d8fc407)
Signed-off-by: Peter Korsgaard <peter@korsgaard.com>
Fixes the following security issues:
- CVE-2021-39240: An issue was discovered in HAProxy 2.2 before 2.2.16, 2.3
before 2.3.13, and 2.4 before 2.4.3. It does not ensure that the scheme
and path portions of a URI have the expected characters. For example, the
authority field (as observed on a target HTTP/2 server) might differ from
what the routing rules were intended to achieve.
- CVE-2021-39241: An issue was discovered in HAProxy 2.0 before 2.0.24, 2.2
before 2.2.16, 2.3 before 2.3.13, and 2.4 before 2.4.3. An HTTP method
name may contain a space followed by the name of a protected resource. It
is possible that a server would interpret this as a request for that
protected resource, such as in the "GET /admin? HTTP/1.1 /static/images
HTTP/1.1" example.
- CVE-2021-39242: An issue was discovered in HAProxy 2.2 before 2.2.16, 2.3
before 2.3.13, and 2.4 before 2.4.3. It can lead to a situation with an
attacker-controlled HTTP Host header, because a mismatch between Host and
authority is mishandled.
For more details, see the advisory:
https://www.mail-archive.com/haproxy@formilux.org/msg41041.html
Signed-off-by: Peter Korsgaard <peter@korsgaard.com>
Since I've dealt and deal with toolchain bugs and their work-around
very often add myself to toolchain topic(toolchain/) as well as
package/binutils and package/gcc.
Signed-off-by: Giulio Benetti <giulio.benetti@benettiengineering.com>
Signed-off-by: Thomas Petazzoni <thomas.petazzoni@bootlin.com>
(cherry picked from commit 8d0fcab128)
Signed-off-by: Peter Korsgaard <peter@korsgaard.com>
The language detection is falling back to the host system
Fortran compiler. An example of this is in RHEL7.9
(gcc4.8.5 20150623 (Red Hat 4.8.5-44)).
This patch bypasses detection and points to the location
where the compiler would be installed (if present). In the
cases where it doesn't exist, the detection falls through
and leaves Fortran disabled.
Fixes:
http://autobuild.buildroot.net/results/8354da225d1e5e337aa7ea62a7e6524fb5f1135f/
Signed-off-by: Matthew Weber <matthew.weber@collins.com>
Signed-off-by: Thomas Petazzoni <thomas.petazzoni@bootlin.com>
(cherry picked from commit 9f59154245)
Signed-off-by: Peter Korsgaard <peter@korsgaard.com>
Add TARGET_NLS_DEPENDENCIES and host-gettext dependency to avoid the
following build failure in a per-package-directorie build with
host-cairo raised because fontconfig installs its ITS files in the wrong
directory (i.e. outside of gettext-tiny symlink):
mkdir -p /tmp/instance-0/output-1/per-package/host-cairo/host
rsync -a --link-dest=/tmp/instance-0/output-1/per-package/host-fontconfig/host/ /tmp/instance-0/output-1/per-package/host-fontconfig/host/ /tmp/instance-0/output-1/per-package/host-cairo/host
rsync -a --link-dest=/tmp/instance-0/output-1/per-package/host-freetype/host/ /tmp/instance-0/output-1/per-package/host-freetype/host/ /tmp/instance-0/output-1/per-package/host-cairo/host
rsync -a --link-dest=/tmp/instance-0/output-1/per-package/host-libglib2/host/ /tmp/instance-0/output-1/per-package/host-libglib2/host/ /tmp/instance-0/output-1/per-package/host-cairo/host
cannot delete non-empty directory: share/gettext
could not make way for new symlink: share/gettext
This only happens with per-package directories because then the rsync is
done. Otherwise the fontconfig installation will simply follow the
symlink.
The error of course exists for target as well, but doesn't occur in
autobuilders since it already fails for host.
Fixes:
- http://autobuild.buildroot.org/results/00e29958cecfffa4e994ab549637117dd8f55c30
Signed-off-by: Fabrice Fontaine <fontaine.fabrice@gmail.com>
Signed-off-by: Arnout Vandecappelle (Essensium/Mind) <arnout@mind.be>
(cherry picked from commit 93351fa0b3)
Signed-off-by: Peter Korsgaard <peter@korsgaard.com>
commit f79a420825 (package/busybox/udhcpc.script: support RFC3442
static routes) used 'set --' clobbering the positional arguments, causing
the action argument to not be correctly forwarded to hook scripts for the
renew / bound cases if static routes are provided by the server.
As a workaround, save the action argument at the beginning of the script and
use that when calling hook scripts.
Reported-by: 王琦 <wangwangqi2011@gmail.com>
Signed-off-by: Peter Korsgaard <peter@korsgaard.com>
(cherry picked from commit 94c41eef61)
Signed-off-by: Peter Korsgaard <peter@korsgaard.com>
The release contains a bugfix to fix the make install of the python
module after build changes introduced in this release RC1.
This release contains a number of bug fixes. There is a crash fix for
broken internal structures in stream reuse, that is used when many TCP
or TLS upstream connections are made. Also a number of features are added.
https://github.com/NLnetLabs/unbound/releases/tag/release-1.13.2
Signed-off-by: Kyle Harding <kyle@balena.io>
Signed-off-by: Peter Korsgaard <peter@korsgaard.com>
(cherry picked from commit aaad2ab8e3)
Signed-off-by: Peter Korsgaard <peter@korsgaard.com>
Sven has privately asked to no longer receive notifications related to
this package.
Signed-off-by: Thomas Petazzoni <thomas.petazzoni@bootlin.com>
(cherry picked from commit 829ecf7d79)
Signed-off-by: Peter Korsgaard <peter@korsgaard.com>
read_header_tga in gd_tga.c in the GD Graphics Library (aka LibGD)
through 2.3.2 allows remote attackers to cause a denial of service
(out-of-bounds read) via a crafted TGA file.
Signed-off-by: Fabrice Fontaine <fontaine.fabrice@gmail.com>
Signed-off-by: Thomas Petazzoni <thomas.petazzoni@bootlin.com>
(cherry picked from commit 0eebfba388)
Signed-off-by: Peter Korsgaard <peter@korsgaard.com>
textview_uri_security_check in textview.c in Claws Mail before 3.18.0,
and Sylpheed through 3.7.0, does not have sufficient link checks before
accepting a click.
Signed-off-by: Fabrice Fontaine <fontaine.fabrice@gmail.com>
Signed-off-by: Thomas Petazzoni <thomas.petazzoni@bootlin.com>
(cherry picked from commit 634dcbd50d)
Signed-off-by: Peter Korsgaard <peter@korsgaard.com>
This affects the package jszip before 3.7.0. Crafting a new zip file
with filenames set to Object prototype values (e.g __proto__, toString,
etc) results in a returned object with a modified prototype instance.
Signed-off-by: Fabrice Fontaine <fontaine.fabrice@gmail.com>
Signed-off-by: Thomas Petazzoni <thomas.petazzoni@bootlin.com>
(cherry picked from commit 921830e92d)
Signed-off-by: Peter Korsgaard <peter@korsgaard.com>
Fix the following build failures on arc and riscv32:
latency.c: In function 'display':
latency.c:326:21: error: format '%ld' expects argument of type 'long int', but argument 2 has type 'time_t' {aka 'long long int'} [-Werror=format=]
326 | ("RTT| %.2ld:%.2ld:%.2ld (%s, %Ld us period, "
| ~~~~^
| |
| long int
| %.2lld
327 | "priority %d)\n", dt / 3600,
| ~~~~~~~~~
| |
| time_t {aka long long int}
altency.c: In function ‘display’:
altency.c:262:21: error: format ‘%ld’ expects argument of type ‘long int’, but argument 2 has type ‘time_t’ {aka ‘long long int’} [-Werror=format=]
262 | ("RTT| %.2ld:%.2ld:%.2ld (%s, %Ld us period, "
| ~~~~^
| |
| long int
| %.2lld
263 | "priority %d)\n", dt / 3600,
| ~~~~~~~~~
| |
| time_t {aka long long int}
Fixes:
- http://autobuild.buildroot.org/results/448efe22e8fe058a1b354a3c124874e30b9ce138
Signed-off-by: Fabrice Fontaine <fontaine.fabrice@gmail.com>
Signed-off-by: Thomas Petazzoni <thomas.petazzoni@bootlin.com>
(cherry picked from commit 74196b7d05)
Signed-off-by: Peter Korsgaard <peter@korsgaard.com>
Fix the following build failure on musl raised since the addition of the
package in commit eb91fa730c:
/tmp/instance-1/output-1/build/ogre-1.12.0/OgreMain/src/OgreStringConverter.cpp: In static member function 'static bool Ogre::StringConverter::parse(const String&, Ogre::int32&)':
/tmp/instance-1/output-1/build/ogre-1.12.0/OgreMain/src/OgreStringConverter.cpp:253:22: error: 'strtol_l' was not declared in this scope; did you mean 'strtold_l'?
253 | ret = (int32)strtol_l(val.c_str(), &end, 0, _numLocale);
| ^~~~~~~~
| strtold_l
Fixes:
- http://autobuild.buildroot.org/results/491f89e45610a7752c0700ac02b80a92b7876ec3
Signed-off-by: Fabrice Fontaine <fontaine.fabrice@gmail.com>
Signed-off-by: Thomas Petazzoni <thomas.petazzoni@bootlin.com>
(cherry picked from commit 84333281cd)
Signed-off-by: Peter Korsgaard <peter@korsgaard.com>
qt5declarative builds qmltyperegistrar for the host as part of its build
process.
When building qt target packages (which is the case for qt5declarative),
-spec devices/linux-buildroot-g++ is passed to qmake in QT5_QMAKE
variable and this spec currently has -latomic in its LIBS.
This -latomic makes it to the build of the host build of
qmltyperegistrar which is not useful.
This was discovered on Fedora 34 where libatomic is not pulled with gcc
package, therefore was missing on the host machine.
This makes sure that -latomic is not added for host build of qt
packages.
Fixes: 7d286be4f9 ("package/qt5base: link with -latomic when needed")
Cc: Quentin Schulz <foss@0leil.net>
Suggested-by: Arnout Vandecappelle <arnout@mind.be>
Signed-off-by: Quentin Schulz <quentin.schulz@theobroma-systems.com>
Signed-off-by: Thomas Petazzoni <thomas.petazzoni@bootlin.com>
(cherry picked from commit 2d991fd7b2)
Signed-off-by: Peter Korsgaard <peter@korsgaard.com>
Commit 5f432df7e2 ("boot/arm-trusted-firmware: change
ENABLE_STACK_PROTECTOR value when disabled") set
ENABLE_STACK_PROTECTOR=0 when disabled. But since we pass this value as
MAKE_OPT, the internal ATF logic that sets ENABLE_STACK_PROTECTOR again
based on its initial value breaks. This leads to build failure:
make[1]: *** [/builds/buildroot.org/buildroot/output/build/arm-trusted-firmware-v2.4/build/a80x0_mcbin/release/libc/assert.o] Error 1
aarch64-buildroot-linux-uclibc-gcc.br_real: error: unrecognized command-line option ‘-fstack-protector-0’; did you mean ‘-fstack-protector’?
Move ENABLE_STACK_PROTECTOR to make environment instead to allow make to
change its value.
Fixes:
https://gitlab.com/buildroot.org/buildroot/-/jobs/1497663294
Cc: Dick Olsson <hi@senzilla.io>
Cc: Sergey Matyukevich <geomatsi@gmail.com>
Cc: Thomas Petazzoni <thomas.petazzoni@bootlin.com
Signed-off-by: Baruch Siach <baruch@tkos.co.il>
Signed-off-by: Peter Korsgaard <peter@korsgaard.com>
(cherry picked from commit ccac9a5bbb)
Signed-off-by: Peter Korsgaard <peter@korsgaard.com>
Since commit
cf176128ec ("boot/arm-trusted-firmware:
add SSP option"), we are passing ENABLE_STACK_PROTECTOR=none when we
want to disable SSP usage in TF-A. While this works fine in recent
versions of TF-A, older versions such as TF-A will end up passing
-fstack-protector-none in this situation, which fails as this is not a
valid gcc option (the valid gcc option is -fno-stack-protector).
To solve this, we pass ENABLE_STACK_PROTECTOR=0 which was in older
TF-A versions used to say "don't do anything with SSP", and is also
still supported in newer versions of TF-A.
Fixes:
https://gitlab.com/buildroot.org/buildroot/-/jobs/1478738580
Signed-off-by: Thomas Petazzoni <thomas.petazzoni@bootlin.com>
(cherry picked from commit 5f432df7e2)
Signed-off-by: Peter Korsgaard <peter@korsgaard.com>
2021-09-01 22:51:19 +02:00
162 changed files with 3533 additions and 423 deletions
strtol_l (and strtoul_l, strtoll_l, strtoull_l) are not always available
(for example on musl) so check for strtol_l and reuse android fallback if
needed to avoid the following build failure:
/home/buildroot/autobuild/instance-1/output-1/build/ogre-1.12.0/OgreMain/src/OgreStringConverter.cpp: In static member function 'static bool Ogre::StringConverter::parse(const String&, Ogre::int32&)':
/home/buildroot/autobuild/instance-1/output-1/build/ogre-1.12.0/OgreMain/src/OgreStringConverter.cpp:253:22: error: 'strtol_l' was not declared in this scope
ret = (int32)strtol_l(val.c_str(), &end, 0, _numLocale);
Some files were not shown because too many files have changed in this diff
Show More
Reference in New Issue
Block a user
Blocking a user prevents them from interacting with repositories, such as opening or commenting on pull requests or issues. Learn more about blocking a user.